{"text_format":"1","workbook":"xlsx","n_sheets":3,"sheets":["Annexure_Sheet","Employee_Data","MinimumWages"],"not_rendered":{"charts":0,"images":3,"macros":1,"external_links":1,"defined_names":10,"comments":0,"pivot_tables":0},"unopened":[],"bounds":{"document_bytes":16777216,"sheet_cells":100000,"rows_first":2000,"rows_last":500,"rows_between":2000,"halvings":0,"cell_chars":16384,"cell_head_chars":4096},"cells_cut":0,"cells_raw":0,"read":"whole","date_system":"1900"}

{"sheet":"Annexure_Sheet","index":0,"n_rows":46,"n_cols":13,"rows_kept":46,"cut":false,"hidden":false,"merged":[[3,8,8,12],[37,2,38,4],[1,2,1,4],[3,3,3,4],[4,3,4,4],[5,3,5,4],[6,3,6,4],[2,2,2,4]]}
[1,null,null,null,null,null,null,null,null,null,1,"To",6]
[{"$f":"IF(VLOOKUP(SRN,Employee_Data!$A$1:$BU$987,MATCH(\"Title\",Employee_Data!$A$1:$BW$1,0),0)=\"Mr.\",\"M\",\"F\")","v":"F"},null,"Salary Annexure"]
[null,null,"CTC STRUCTURE & BENEFITS 2023 - 2024"]
[null,null,"Employee Name",{"$f":"VLOOKUP(SRN,Employee_Data!$A$1:$BU$987,MATCH(\"Title\",Employee_Data!$A$1:$BW$1,0),0)&\" \"&VLOOKUP(SRN,Employee_Data!$A$1:$BU$987,MATCH(Annexure_Sheet!C4,Employee_Data!$A$1:$BW$1,0),0)","v":"Ms. AVLEEN KUMAR"},null,null,null,null,"This Sheet prepared by Kumar Ajit, and it's Free to download and use for All. Any paid Assistance Required: ajityadav121@gmail.com"]
[null,null,"Emp.Code",{"$f":"VLOOKUP(SRN,Employee_Data!$A$1:$BU$987,MATCH(Annexure_Sheet!C5,Employee_Data!$A$1:$BW$1,0),0)","v":"E0001"}]
[null,null,"Designation",{"$f":"VLOOKUP(SRN,Employee_Data!$A$1:$BU$987,MATCH(Annexure_Sheet!C6,Employee_Data!$A$1:$BW$1,0),0)","v":"Manager"}]
[null,null,"STATE",{"$f":"VLOOKUP(SRN,Employee_Data!$A$1:$BU$987,MATCH(Annexure_Sheet!C7,Employee_Data!$A$1:$BW$1,0),0)","v":"Delhi"}]
[null,null,"Particulars","Monthly (Rs.)","Annual (Rs.)"]
[null,null,{"$f":"TRANSPOSE(Employee_Data!$N$1:$U$1)","v":"Basic Salary"},{"$f":"VLOOKUP(SRN,Employee_Data!$A$1:$BU$987,MATCH(Annexure_Sheet!C9,Employee_Data!$A$1:$BW$1,0),0)","v":20357},{"$f":"ROUND(D9*12,0)","v":244284}]
[null,null,"House Rent Allowance",{"$f":"VLOOKUP(SRN,Employee_Data!$A$1:$BU$987,MATCH(Annexure_Sheet!C10,Employee_Data!$A$1:$BW$1,0),0)","v":1018},{"$f":"ROUND(D10*12,0)","v":12216}]
[null,null,"Special Allowance",{"$f":"VLOOKUP(SRN,Employee_Data!$A$1:$BU$987,MATCH(Annexure_Sheet!C11,Employee_Data!$A$1:$BW$1,0),0)","v":-1292},-15504]
[null,null,"Washing Allowance",{"$f":"VLOOKUP(SRN,Employee_Data!$A$1:$BU$987,MATCH(Annexure_Sheet!C12,Employee_Data!$A$1:$BW$1,0),0)","v":0},0]
[null,null,"Uniform Allowance",{"$f":"VLOOKUP(SRN,Employee_Data!$A$1:$BU$987,MATCH(Annexure_Sheet!C13,Employee_Data!$A$1:$BW$1,0),0)","v":0},0]
[null,null,"Child Education Allowance",{"$f":"VLOOKUP(SRN,Employee_Data!$A$1:$BU$987,MATCH(Annexure_Sheet!C14,Employee_Data!$A$1:$BW$1,0),0)","v":0},0]
[null,null,"Fuel Reimbursement",{"$f":"VLOOKUP(SRN,Employee_Data!$A$1:$BU$987,MATCH(Annexure_Sheet!C15,Employee_Data!$A$1:$BW$1,0),0)","v":0},0]
[null,null,"NPS Contribution",{"$f":"VLOOKUP(SRN,Employee_Data!$A$1:$BU$987,MATCH(Annexure_Sheet!C16,Employee_Data!$A$1:$BW$1,0),0)","v":0},0]
[null,null,"Gross Salary [A]",{"$f":"SUM(D9:D16)","v":20083},{"$f":"SUM(E9:E16)","v":240996}]
[null,null,{"$f":"TRANSPOSE(Employee_Data!$W$1:$X$1)","v":"PF Employer"},{"$f":"VLOOKUP(SRN,Employee_Data!$A$1:$BU$987,MATCH(Annexure_Sheet!C18,Employee_Data!$A$1:$BW$1,0),0)","v":2443},29316]
[null,null,"ESIC Employer",{"$f":"VLOOKUP(SRN,Employee_Data!$A$1:$BU$987,MATCH(Annexure_Sheet!C19,Employee_Data!$A$1:$BW$1,0),0)","v":754},9048]
[null,null,"Fixed Salary [B]",{"$f":"SUM(D17:D19)","v":23280},{"$f":"SUM(E17:E19)","v":279360}]
[null,null,{"$f":"TRANSPOSE(Employee_Data!$Z$1:$AB$1)","v":"Bonus"},{"$f":"VLOOKUP(SRN,Employee_Data!$A$1:$BU$987,MATCH(Annexure_Sheet!C21,Employee_Data!$A$1:$BW$1,0),0)","v":1741},20892]
[null,null,"Gratuity",{"$f":"VLOOKUP(SRN,Employee_Data!$A$1:$BU$987,MATCH(Annexure_Sheet!C22,Employee_Data!$A$1:$BW$1,0),0)","v":979},11748]
[null,null,"Variable Pay",{"$f":"VLOOKUP(SRN,Employee_Data!$A$1:$BU$987,MATCH(Annexure_Sheet!C23,Employee_Data!$A$1:$BW$1,0),0)","v":0},0]
[null,null,"CTC - Grand Total [C]",{"$f":"SUM(D20:D23)","v":26000},{"$f":"SUM(E20:E23)","v":312000}]
[null,null,"Deductions:"," "," "]
[null,null,"PF Employee Contribution",{"$f":"D18","v":2443},29316]
[null,null,"ESIC Employee Contribution",{"$f":"IF(D19>0,ROUND(D17*0.75%,0),0)","v":151},1812]
[null,null,"Labour Welfare Fund (LWF)",{"$f":"LWF(UPPER(D7),TODAY())","v":1},{"$f":"ROUND(D28*12,0)","v":12}]
[null,null,"Professional Tax (P.Tax)",{"$f":"PTAX(UPPER(D7),D17,A2)","v":0},{"$f":"ROUND(D29*12,0)","v":0}]
[null,null,"Net In-Hand (Before Tax)      [A - Deductions]",{"$f":"D17-D26-D27-D28-D29","v":17488},{"$f":"E17-E26-E27-E28-E29","v":209856}]
[null,null,"Note:"]
[null,null,"* The relevant provisions of the Income Tax & other relevant statutes will be borne by you."]
[null,null,"* The statutory bonus payout will be as per the payment of Bonus Act, 1965."]
[null,null,"*  In addition to the above you will also be entitled to:-"]
[null,null,"• Gratuity as applicable under the Payment of Gratuity Act 1972."]
[null,null,"• Mediclaim, as per company policy for those who are not covered under ESIC."]
[]
[null,null,"The company is committed to maintain the confidentiality of your compensation data. Please do not discuss this with any other employee, except your immediate superior and HR."]
[]
[]
[null,null,"Wishing you the very best."]
[null,null,"Best Regards,"]
[]
[]
[null,null,"Kumar Singh"]
[null,null,"Human Resource"]

{"sheet":"Employee_Data","index":1,"n_rows":462,"n_cols":32,"rows_kept":462,"cut":false,"hidden":false,"merged":[]}
["SR","Emp.Code","Title","Employee Name","DOJ","Designation","STATE","Worker's Skill","PF Applicable","PF Limit","MONTHLY_CTC","MINWAGES","ANNUAL","Basic Salary","House Rent Allowance","Special Allowance","Washing Allowance","Uniform Allowance","Child Education Allowance","Fuel Reimbursement","NPS Contribution","Gross Salary [Total]","PF Employer","ESIC Employer","Fixed Salary [Total]","Bonus","Gratuity","Variable Pay","Monthly CTC","Annual CTC","DIFF","Error Remark"]
[{"$f":"ROW()-1","v":1},"E0001","Ms.","AVLEEN KUMAR","2012-03-31","Manager","Delhi","Skilled","Yes","Yes",26000,{"$f":"IFERROR(VLOOKUP(G2,MinimumWages!$A$1:$R$60,MATCH(Employee_Data!H2,MinimumWages!$A$1:$R$1,0),0),0)","v":20903},{"$f":"ROUND(K2*12,0)","v":312000},{"$f":"ROUND(MAX(ROUNDUP(IF(K2>30000,K2/2,L2/3*2),-2),IFERROR(VLOOKUP(G2,MinimumWages!$A$1:$R$60,(MATCH(Employee_Data!H2,MinimumWages!$A$1:$R$1,0)-4),0),0)),0)","v":20357},{"$f":"ROUND(IF(K2<30000,N2*5%,N2/2),0)","v":1018},-1292,0,0,0,0,0,{"$f":"SUM(N2:U2)","v":20083},{"$f":"IF(I2=\"Yes\",ROUND(IF(J2=\"Limit\",MIN((V2-O2),15000),IF(N2>15000,N2,MIN((V2-O2),15000)))*12%,0),0)","v":2443},{"$f":"IF(V2>21000,0,ROUNDUP(V2*3.75%,0))","v":754},{"$f":"SUM(V2:X2)","v":23280},{"$f":"IF(AND(N2<=21000,K2>0),ROUND(MAX(L2,7000)*8.33%,0),0)","v":1741},{"$f":"ROUND(N2/26*15/12,0)","v":979},0,{"$f":"SUM(Y2:AB2)","v":26000},{"$f":"ROUND(AC2*12,0)","v":312000},{"$f":"ROUND((M2-AD2)/12,0)","v":0},{"$f":"IF(AE2<>0,\"Un-Matched CTC\",IF(COUNTIF(N2:AE2,\"<0\")>0,\"Less CTC\",\"-\"))","v":"Less CTC"}]
[{"$f":"ROW()-1","v":2},"E0002","Mrs.","ANIL YADAV","2010-11-23","Executive","Delhi","Semi-Skilled","Yes","On-Basic",330908,{"$f":"IFERROR(VLOOKUP(G3,MinimumWages!$A$1:$R$60,MATCH(Employee_Data!H3,MinimumWages!$A$1:$R$1,0),0),0)","v":18993},3970896,{"$f":"ROUND(MAX(ROUNDUP(IF(K3>30000,K3/2,L3/3*2),-2),IFERROR(VLOOKUP(G3,MinimumWages!$A$1:$R$60,(MATCH(Employee_Data!H3,MinimumWages!$A$1:$R$1,0)-4),0),0)),0)","v":165500},82750,54841,0,0,0,0,0,{"$f":"SUM(N3:U3)","v":303091},19860,{"$f":"IF(V3>21000,0,ROUNDUP(V3*3.75%,0))","v":0},{"$f":"SUM(V3:X3)","v":322951},0,{"$f":"ROUND(N3/26*15/12,0)","v":7957},0,{"$f":"SUM(Y3:AB3)","v":330908},{"$f":"ROUND(AC3*12,0)","v":3970896},{"$f":"ROUND((M3-AD3)/12,0)","v":0},{"$f":"IF(AE3<>0,\"Un-Matched CTC\",IF(COUNTIF(N3:AE3,\"<0\")>0,\"Less CTC\",\"-\"))","v":"-"}]
[3,"E0003","Ms.","ANCHAL SHARMA","2011-04-01","Sr. Executive","Haryana","Skilled","Yes","Yes",42717,{"$f":"IFERROR(VLOOKUP(G4,MinimumWages!$A$1:$R$60,MATCH(Employee_Data!H4,MinimumWages!$A$1:$R$1,0),0),0)","v":12803},512604,{"$f":"ROUND(MAX(ROUNDUP(IF(K4>30000,K4/2,L4/3*2),-2),IFERROR(VLOOKUP(G4,MinimumWages!$A$1:$R$60,(MATCH(Employee_Data!H4,MinimumWages!$A$1:$R$1,0)-4),0),0)),0)","v":21400},10700,7020,0,0,0,0,0,39120,2568,0,41688,0,1029,0,42717,512604,0,"-"]
[4,"E0004","Mr.","BRAHM MISHRA","2013-05-29","Sr. Executive","Maharashtra","Skilled","Not-Applicable","Yes",16000,{"$f":"IFERROR(VLOOKUP(G5,MinimumWages!$A$1:$R$60,MATCH(Employee_Data!H5,MinimumWages!$A$1:$R$1,0),0),0)","v":14658},192000,{"$f":"ROUND(MAX(ROUNDUP(IF(K5>30000,K5/2,L5/3*2),-2),IFERROR(VLOOKUP(G5,MinimumWages!$A$1:$R$60,(MATCH(Employee_Data!H5,MinimumWages!$A$1:$R$1,0)-4),0),0)),0)","v":11632},582,1492,0,0,0,0,0,13706,0,514,14220,1221,559,0,16000,192000,0,"-"]
[5,"E0005","Mr.","PURAN UNIYAL","2019-11-30","Executive","Bihar","Skilled","Yes","Yes",45808,{"$f":"IFERROR(VLOOKUP(G6,MinimumWages!$A$1:$R$60,MATCH(Employee_Data!H6,MinimumWages!$A$1:$R$1,0),0),0)","v":12766},549696,{"$f":"ROUND(MAX(ROUNDUP(IF(K6>30000,K6/2,L6/3*2),-2),IFERROR(VLOOKUP(G6,MinimumWages!$A$1:$R$60,(MATCH(Employee_Data!H6,MinimumWages!$A$1:$R$1,0)-4),0),0)),0)","v":23000},11500,7442,0,0,0,0,0,41942,2760,0,44702,0,1106,0,45808,549696,0,"-"]
[6,"E0006","Mrs.","MAHESH RAJBHAR","2009-04-12","Sr. Manager","Maharashtra","Skilled","Yes","Yes",69975,{"$f":"IFERROR(VLOOKUP(G7,MinimumWages!$A$1:$R$60,MATCH(Employee_Data!H7,MinimumWages!$A$1:$R$1,0),0),0)","v":14658},839700,{"$f":"ROUND(MAX(ROUNDUP(IF(K7>30000,K7/2,L7/3*2),-2),IFERROR(VLOOKUP(G7,MinimumWages!$A$1:$R$60,(MATCH(Employee_Data!H7,MinimumWages!$A$1:$R$1,0)-4),0),0)),0)","v":35000},17500,11592,0,0,0,0,0,64092,4200,0,68292,0,1683,0,69975,839700,0,"-"]
[7,null,null,null,null,null,null,null,null,null,null,{"$f":"IFERROR(VLOOKUP(G8,MinimumWages!$A$1:$R$60,MATCH(Employee_Data!H8,MinimumWages!$A$1:$R$1,0),0),0)","v":0},{"$f":"ROUND(K8*12,0)","v":0},{"$f":"ROUND(MAX(ROUNDUP(IF(K8>30000,K8/2,L8/3*2),-2),IFERROR(VLOOKUP(G8,MinimumWages!$A$1:$R$60,(MATCH(Employee_Data!H8,MinimumWages!$A$1:$R$1,0)-4),0),0)),0)","v":0},{"$f":"ROUND(IF(K8<30000,N8*5%,N8/2),0)","v":0},0,0,0,0,0,0,{"$f":"SUM(N8:U8)","v":0},{"$f":"IF(I8=\"Yes\",ROUND(IF(J8=\"Limit\",MIN((V8-O8),15000),IF(N8>15000,N8,MIN((V8-O8),15000)))*12%,0),0)","v":0},{"$f":"IF(V8>21000,0,ROUNDUP(V8*3.75%,0))","v":0},{"$f":"SUM(V8:X8)","v":0},{"$f":"IF(AND(N8<=21000,K8>0),ROUND(MAX(L8,7000)*8.33%,0),0)","v":0},{"$f":"ROUND(N8/26*15/12,0)","v":0},0,{"$f":"SUM(Y8:AB8)","v":0},0,{"$f":"ROUND((M8-AD8)/12,0)","v":0},{"$f":"IF(AE8<>0,\"Un-Matched CTC\",IF(COUNTIF(N8:AE8,\"<0\")>0,\"Less CTC\",\"-\"))","v":"-"}]
[8,null,null,null,null,null,null,null,null,null,null,{"$f":"IFERROR(VLOOKUP(G9,MinimumWages!$A$1:$R$60,MATCH(Employee_Data!H9,MinimumWages!$A$1:$R$1,0),0),0)","v":0},0,{"$f":"ROUND(MAX(ROUNDUP(IF(K9>30000,K9/2,L9/3*2),-2),IFERROR(VLOOKUP(G9,MinimumWages!$A$1:$R$60,(MATCH(Employee_Data!H9,MinimumWages!$A$1:$R$1,0)-4),0),0)),0)","v":0},0,0,0,0,0,0,0,0,0,0,0,0,0,0,0,0,0,"-"]
[9,null,null,null,null,null,null,null,null,null,null,{"$f":"IFERROR(VLOOKUP(G10,MinimumWages!$A$1:$R$60,MATCH(Employee_Data!H10,MinimumWages!$A$1:$R$1,0),0),0)","v":0},0,{"$f":"ROUND(MAX(ROUNDUP(IF(K10>30000,K10/2,L10/3*2),-2),IFERROR(VLOOKUP(G10,MinimumWages!$A$1:$R$60,(MATCH(Employee_Data!H10,MinimumWages!$A$1:$R$1,0)-4),0),0)),0)","v":0},0,0,0,0,0,0,0,0,0,0,0,0,0,0,0,0,0,"-"]
[10,null,null,null,null,null,null,null,null,null,null,{"$f":"IFERROR(VLOOKUP(G11,MinimumWages!$A$1:$R$60,MATCH(Employee_Data!H11,MinimumWages!$A$1:$R$1,0),0),0)","v":0},0,{"$f":"ROUND(MAX(ROUNDUP(IF(K11>30000,K11/2,L11/3*2),-2),IFERROR(VLOOKUP(G11,MinimumWages!$A$1:$R$60,(MATCH(Employee_Data!H11,MinimumWages!$A$1:$R$1,0)-4),0),0)),0)","v":0},0,0,0,0,0,0,0,0,0,0,0,0,0,0,0,0,0,"-"]
[11,null,null,null,null,null,null,null,null,null,null,{"$f":"IFERROR(VLOOKUP(G12,MinimumWages!$A$1:$R$60,MATCH(Employee_Data!H12,MinimumWages!$A$1:$R$1,0),0),0)","v":0},0,{"$f":"ROUND(MAX(ROUNDUP(IF(K12>30000,K12/2,L12/3*2),-2),IFERROR(VLOOKUP(G12,MinimumWages!$A$1:$R$60,(MATCH(Employee_Data!H12,MinimumWages!$A$1:$R$1,0)-4),0),0)),0)","v":0},0,0,0,0,0,0,0,0,0,0,0,0,0,0,0,0,0,"-"]
[12,null,null,null,null,null,null,null,null,null,null,{"$f":"IFERROR(VLOOKUP(G13,MinimumWages!$A$1:$R$60,MATCH(Employee_Data!H13,MinimumWages!$A$1:$R$1,0),0),0)","v":0},0,{"$f":"ROUND(MAX(ROUNDUP(IF(K13>30000,K13/2,L13/3*2),-2),IFERROR(VLOOKUP(G13,MinimumWages!$A$1:$R$60,(MATCH(Employee_Data!H13,MinimumWages!$A$1:$R$1,0)-4),0),0)),0)","v":0},0,0,0,0,0,0,0,0,0,0,0,0,0,0,0,0,0,"-"]
[13,null,null,null,null,null,null,null,null,null,null,{"$f":"IFERROR(VLOOKUP(G14,MinimumWages!$A$1:$R$60,MATCH(Employee_Data!H14,MinimumWages!$A$1:$R$1,0),0),0)","v":0},0,{"$f":"ROUND(MAX(ROUNDUP(IF(K14>30000,K14/2,L14/3*2),-2),IFERROR(VLOOKUP(G14,MinimumWages!$A$1:$R$60,(MATCH(Employee_Data!H14,MinimumWages!$A$1:$R$1,0)-4),0),0)),0)","v":0},0,0,0,0,0,0,0,0,0,0,0,0,0,0,0,0,0,"-"]
[14,null,null,null,null,null,null,null,null,null,null,{"$f":"IFERROR(VLOOKUP(G15,MinimumWages!$A$1:$R$60,MATCH(Employee_Data!H15,MinimumWages!$A$1:$R$1,0),0),0)","v":0},0,{"$f":"ROUND(MAX(ROUNDUP(IF(K15>30000,K15/2,L15/3*2),-2),IFERROR(VLOOKUP(G15,MinimumWages!$A$1:$R$60,(MATCH(Employee_Data!H15,MinimumWages!$A$1:$R$1,0)-4),0),0)),0)","v":0},0,0,0,0,0,0,0,0,0,0,0,0,0,0,0,0,0,"-"]
[15,null,null,null,null,null,null,null,null,null,null,{"$f":"IFERROR(VLOOKUP(G16,MinimumWages!$A$1:$R$60,MATCH(Employee_Data!H16,MinimumWages!$A$1:$R$1,0),0),0)","v":0},0,{"$f":"ROUND(MAX(ROUNDUP(IF(K16>30000,K16/2,L16/3*2),-2),IFERROR(VLOOKUP(G16,MinimumWages!$A$1:$R$60,(MATCH(Employee_Data!H16,MinimumWages!$A$1:$R$1,0)-4),0),0)),0)","v":0},0,0,0,0,0,0,0,0,0,0,0,0,0,0,0,0,0,"-"]
[16,null,null,null,null,null,null,null,null,null,null,{"$f":"IFERROR(VLOOKUP(G17,MinimumWages!$A$1:$R$60,MATCH(Employee_Data!H17,MinimumWages!$A$1:$R$1,0),0),0)","v":0},0,{"$f":"ROUND(MAX(ROUNDUP(IF(K17>30000,K17/2,L17/3*2),-2),IFERROR(VLOOKUP(G17,MinimumWages!$A$1:$R$60,(MATCH(Employee_Data!H17,MinimumWages!$A$1:$R$1,0)-4),0),0)),0)","v":0},0,0,0,0,0,0,0,0,0,0,0,0,0,0,0,0,0,"-"]
[17,null,null,null,null,null,null,null,null,null,null,{"$f":"IFERROR(VLOOKUP(G18,MinimumWages!$A$1:$R$60,MATCH(Employee_Data!H18,MinimumWages!$A$1:$R$1,0),0),0)","v":0},0,{"$f":"ROUND(MAX(ROUNDUP(IF(K18>30000,K18/2,L18/3*2),-2),IFERROR(VLOOKUP(G18,MinimumWages!$A$1:$R$60,(MATCH(Employee_Data!H18,MinimumWages!$A$1:$R$1,0)-4),0),0)),0)","v":0},0,0,0,0,0,0,0,0,0,0,0,0,0,0,0,0,0,"-"]
[18,null,null,null,null,null,null,null,null,null,null,{"$f":"IFERROR(VLOOKUP(G19,MinimumWages!$A$1:$R$60,MATCH(Employee_Data!H19,MinimumWages!$A$1:$R$1,0),0),0)","v":0},0,{"$f":"ROUND(MAX(ROUNDUP(IF(K19>30000,K19/2,L19/3*2),-2),IFERROR(VLOOKUP(G19,MinimumWages!$A$1:$R$60,(MATCH(Employee_Data!H19,MinimumWages!$A$1:$R$1,0)-4),0),0)),0)","v":0},0,0,0,0,0,0,0,0,0,0,0,0,0,0,0,0,0,"-"]
[19,null,null,null,null,null,null,null,null,null,null,{"$f":"IFERROR(VLOOKUP(G20,MinimumWages!$A$1:$R$60,MATCH(Employee_Data!H20,MinimumWages!$A$1:$R$1,0),0),0)","v":0},0,{"$f":"ROUND(MAX(ROUNDUP(IF(K20>30000,K20/2,L20/3*2),-2),IFERROR(VLOOKUP(G20,MinimumWages!$A$1:$R$60,(MATCH(Employee_Data!H20,MinimumWages!$A$1:$R$1,0)-4),0),0)),0)","v":0},0,0,0,0,0,0,0,0,0,0,0,0,0,0,0,0,0,"-"]
[20,null,null,null,null,null,null,null,null,null,null,{"$f":"IFERROR(VLOOKUP(G21,MinimumWages!$A$1:$R$60,MATCH(Employee_Data!H21,MinimumWages!$A$1:$R$1,0),0),0)","v":0},0,{"$f":"ROUND(MAX(ROUNDUP(IF(K21>30000,K21/2,L21/3*2),-2),IFERROR(VLOOKUP(G21,MinimumWages!$A$1:$R$60,(MATCH(Employee_Data!H21,MinimumWages!$A$1:$R$1,0)-4),0),0)),0)","v":0},0,0,0,0,0,0,0,0,0,0,0,0,0,0,0,0,0,"-"]
[21,null,null,null,null,null,null,null,null,null,null,{"$f":"IFERROR(VLOOKUP(G22,MinimumWages!$A$1:$R$60,MATCH(Employee_Data!H22,MinimumWages!$A$1:$R$1,0),0),0)","v":0},0,{"$f":"ROUND(MAX(ROUNDUP(IF(K22>30000,K22/2,L22/3*2),-2),IFERROR(VLOOKUP(G22,MinimumWages!$A$1:$R$60,(MATCH(Employee_Data!H22,MinimumWages!$A$1:$R$1,0)-4),0),0)),0)","v":0},0,0,0,0,0,0,0,0,0,0,0,0,0,0,0,0,0,"-"]
[22,null,null,null,null,null,null,null,null,null,null,{"$f":"IFERROR(VLOOKUP(G23,MinimumWages!$A$1:$R$60,MATCH(Employee_Data!H23,MinimumWages!$A$1:$R$1,0),0),0)","v":0},0,{"$f":"ROUND(MAX(ROUNDUP(IF(K23>30000,K23/2,L23/3*2),-2),IFERROR(VLOOKUP(G23,MinimumWages!$A$1:$R$60,(MATCH(Employee_Data!H23,MinimumWages!$A$1:$R$1,0)-4),0),0)),0)","v":0},0,0,0,0,0,0,0,0,0,0,0,0,0,0,0,0,0,"-"]
[23,null,null,null,null,null,null,null,null,null,null,{"$f":"IFERROR(VLOOKUP(G24,MinimumWages!$A$1:$R$60,MATCH(Employee_Data!H24,MinimumWages!$A$1:$R$1,0),0),0)","v":0},0,{"$f":"ROUND(MAX(ROUNDUP(IF(K24>30000,K24/2,L24/3*2),-2),IFERROR(VLOOKUP(G24,MinimumWages!$A$1:$R$60,(MATCH(Employee_Data!H24,MinimumWages!$A$1:$R$1,0)-4),0),0)),0)","v":0},0,0,0,0,0,0,0,0,0,0,0,0,0,0,0,0,0,"-"]
[24,null,null,null,null,null,null,null,null,null,null,{"$f":"IFERROR(VLOOKUP(G25,MinimumWages!$A$1:$R$60,MATCH(Employee_Data!H25,MinimumWages!$A$1:$R$1,0),0),0)","v":0},0,{"$f":"ROUND(MAX(ROUNDUP(IF(K25>30000,K25/2,L25/3*2),-2),IFERROR(VLOOKUP(G25,MinimumWages!$A$1:$R$60,(MATCH(Employee_Data!H25,MinimumWages!$A$1:$R$1,0)-4),0),0)),0)","v":0},0,0,0,0,0,0,0,0,0,0,0,0,0,0,0,0,0,"-"]
[25,null,null,null,null,null,null,null,null,null,null,{"$f":"IFERROR(VLOOKUP(G26,MinimumWages!$A$1:$R$60,MATCH(Employee_Data!H26,MinimumWages!$A$1:$R$1,0),0),0)","v":0},0,{"$f":"ROUND(MAX(ROUNDUP(IF(K26>30000,K26/2,L26/3*2),-2),IFERROR(VLOOKUP(G26,MinimumWages!$A$1:$R$60,(MATCH(Employee_Data!H26,MinimumWages!$A$1:$R$1,0)-4),0),0)),0)","v":0},0,0,0,0,0,0,0,0,0,0,0,0,0,0,0,0,0,"-"]
[26,null,null,null,null,null,null,null,null,null,null,{"$f":"IFERROR(VLOOKUP(G27,MinimumWages!$A$1:$R$60,MATCH(Employee_Data!H27,MinimumWages!$A$1:$R$1,0),0),0)","v":0},0,{"$f":"ROUND(MAX(ROUNDUP(IF(K27>30000,K27/2,L27/3*2),-2),IFERROR(VLOOKUP(G27,MinimumWages!$A$1:$R$60,(MATCH(Employee_Data!H27,MinimumWages!$A$1:$R$1,0)-4),0),0)),0)","v":0},0,0,0,0,0,0,0,0,0,0,0,0,0,0,0,0,0,"-"]
[27,null,null,null,null,null,null,null,null,null,null,{"$f":"IFERROR(VLOOKUP(G28,MinimumWages!$A$1:$R$60,MATCH(Employee_Data!H28,MinimumWages!$A$1:$R$1,0),0),0)","v":0},0,{"$f":"ROUND(MAX(ROUNDUP(IF(K28>30000,K28/2,L28/3*2),-2),IFERROR(VLOOKUP(G28,MinimumWages!$A$1:$R$60,(MATCH(Employee_Data!H28,MinimumWages!$A$1:$R$1,0)-4),0),0)),0)","v":0},0,0,0,0,0,0,0,0,0,0,0,0,0,0,0,0,0,"-"]
[28,null,null,null,null,null,null,null,null,null,null,{"$f":"IFERROR(VLOOKUP(G29,MinimumWages!$A$1:$R$60,MATCH(Employee_Data!H29,MinimumWages!$A$1:$R$1,0),0),0)","v":0},0,{"$f":"ROUND(MAX(ROUNDUP(IF(K29>30000,K29/2,L29/3*2),-2),IFERROR(VLOOKUP(G29,MinimumWages!$A$1:$R$60,(MATCH(Employee_Data!H29,MinimumWages!$A$1:$R$1,0)-4),0),0)),0)","v":0},0,0,0,0,0,0,0,0,0,0,0,0,0,0,0,0,0,"-"]
[29,null,null,null,null,null,null,null,null,null,null,{"$f":"IFERROR(VLOOKUP(G30,MinimumWages!$A$1:$R$60,MATCH(Employee_Data!H30,MinimumWages!$A$1:$R$1,0),0),0)","v":0},0,{"$f":"ROUND(MAX(ROUNDUP(IF(K30>30000,K30/2,L30/3*2),-2),IFERROR(VLOOKUP(G30,MinimumWages!$A$1:$R$60,(MATCH(Employee_Data!H30,MinimumWages!$A$1:$R$1,0)-4),0),0)),0)","v":0},0,0,0,0,0,0,0,0,0,0,0,0,0,0,0,0,0,"-"]
[30,null,null,null,null,null,null,null,null,null,null,{"$f":"IFERROR(VLOOKUP(G31,MinimumWages!$A$1:$R$60,MATCH(Employee_Data!H31,MinimumWages!$A$1:$R$1,0),0),0)","v":0},{"$f":"ROUND(K31*12,0)","v":0},{"$f":"ROUND(MAX(ROUNDUP(IF(K31>30000,K31/2,L31/3*2),-2),IFERROR(VLOOKUP(G31,MinimumWages!$A$1:$R$60,(MATCH(Employee_Data!H31,MinimumWages!$A$1:$R$1,0)-4),0),0)),0)","v":0},{"$f":"ROUND(IF(K31<30000,N31*5%,N31/2),0)","v":0},0,0,0,0,0,0,{"$f":"SUM(N31:U31)","v":0},{"$f":"IF(I31=\"Yes\",ROUND(IF(J31=\"Limit\",MIN((V31-O31),15000),IF(N31>15000,N31,MIN((V31-O31),15000)))*12%,0),0)","v":0},{"$f":"IF(V31>21000,0,ROUNDUP(V31*3.75%,0))","v":0},{"$f":"SUM(V31:X31)","v":0},{"$f":"IF(AND(N31<=21000,K31>0),ROUND(MAX(L31,7000)*8.33%,0),0)","v":0},{"$f":"ROUND(N31/26*15/12,0)","v":0},0,{"$f":"SUM(Y31:AB31)","v":0},0,{"$f":"ROUND((M31-AD31)/12,0)","v":0},{"$f":"IF(AE31<>0,\"Un-Matched CTC\",IF(COUNTIF(N31:AE31,\"<0\")>0,\"Less CTC\",\"-\"))","v":"-"}]
[31,null,null,null,null,null,null,null,null,null,null,{"$f":"IFERROR(VLOOKUP(G32,MinimumWages!$A$1:$R$60,MATCH(Employee_Data!H32,MinimumWages!$A$1:$R$1,0),0),0)","v":0},0,{"$f":"ROUND(MAX(ROUNDUP(IF(K32>30000,K32/2,L32/3*2),-2),IFERROR(VLOOKUP(G32,MinimumWages!$A$1:$R$60,(MATCH(Employee_Data!H32,MinimumWages!$A$1:$R$1,0)-4),0),0)),0)","v":0},0,0,0,0,0,0,0,0,0,0,0,0,0,0,0,0,0,"-"]
[32,null,null,null,null,null,null,null,null,null,null,{"$f":"IFERROR(VLOOKUP(G33,MinimumWages!$A$1:$R$60,MATCH(Employee_Data!H33,MinimumWages!$A$1:$R$1,0),0),0)","v":0},0,{"$f":"ROUND(MAX(ROUNDUP(IF(K33>30000,K33/2,L33/3*2),-2),IFERROR(VLOOKUP(G33,MinimumWages!$A$1:$R$60,(MATCH(Employee_Data!H33,MinimumWages!$A$1:$R$1,0)-4),0),0)),0)","v":0},0,0,0,0,0,0,0,0,0,0,0,0,0,0,0,0,0,"-"]
[33,null,null,null,null,null,null,null,null,null,null,{"$f":"IFERROR(VLOOKUP(G34,MinimumWages!$A$1:$R$60,MATCH(Employee_Data!H34,MinimumWages!$A$1:$R$1,0),0),0)","v":0},0,{"$f":"ROUND(MAX(ROUNDUP(IF(K34>30000,K34/2,L34/3*2),-2),IFERROR(VLOOKUP(G34,MinimumWages!$A$1:$R$60,(MATCH(Employee_Data!H34,MinimumWages!$A$1:$R$1,0)-4),0),0)),0)","v":0},0,0,0,0,0,0,0,0,0,0,0,0,0,0,0,0,0,"-"]
[34,null,null,null,null,null,null,null,null,null,null,{"$f":"IFERROR(VLOOKUP(G35,MinimumWages!$A$1:$R$60,MATCH(Employee_Data!H35,MinimumWages!$A$1:$R$1,0),0),0)","v":0},0,{"$f":"ROUND(MAX(ROUNDUP(IF(K35>30000,K35/2,L35/3*2),-2),IFERROR(VLOOKUP(G35,MinimumWages!$A$1:$R$60,(MATCH(Employee_Data!H35,MinimumWages!$A$1:$R$1,0)-4),0),0)),0)","v":0},0,0,0,0,0,0,0,0,0,0,0,0,0,0,0,0,0,"-"]
[35,null,null,null,null,null,null,null,null,null,null,{"$f":"IFERROR(VLOOKUP(G36,MinimumWages!$A$1:$R$60,MATCH(Employee_Data!H36,MinimumWages!$A$1:$R$1,0),0),0)","v":0},0,{"$f":"ROUND(MAX(ROUNDUP(IF(K36>30000,K36/2,L36/3*2),-2),IFERROR(VLOOKUP(G36,MinimumWages!$A$1:$R$60,(MATCH(Employee_Data!H36,MinimumWages!$A$1:$R$1,0)-4),0),0)),0)","v":0},0,0,0,0,0,0,0,0,0,0,0,0,0,0,0,0,0,"-"]
[36,null,null,null,null,null,null,null,null,null,null,{"$f":"IFERROR(VLOOKUP(G37,MinimumWages!$A$1:$R$60,MATCH(Employee_Data!H37,MinimumWages!$A$1:$R$1,0),0),0)","v":0},0,{"$f":"ROUND(MAX(ROUNDUP(IF(K37>30000,K37/2,L37/3*2),-2),IFERROR(VLOOKUP(G37,MinimumWages!$A$1:$R$60,(MATCH(Employee_Data!H37,MinimumWages!$A$1:$R$1,0)-4),0),0)),0)","v":0},0,0,0,0,0,0,0,0,0,0,0,0,0,0,0,0,0,"-"]
[37,null,null,null,null,null,null,null,null,null,null,{"$f":"IFERROR(VLOOKUP(G38,MinimumWages!$A$1:$R$60,MATCH(Employee_Data!H38,MinimumWages!$A$1:$R$1,0),0),0)","v":0},0,{"$f":"ROUND(MAX(ROUNDUP(IF(K38>30000,K38/2,L38/3*2),-2),IFERROR(VLOOKUP(G38,MinimumWages!$A$1:$R$60,(MATCH(Employee_Data!H38,MinimumWages!$A$1:$R$1,0)-4),0),0)),0)","v":0},0,0,0,0,0,0,0,0,0,0,0,0,0,0,0,0,0,"-"]
[38,null,null,null,null,null,null,null,null,null,null,{"$f":"IFERROR(VLOOKUP(G39,MinimumWages!$A$1:$R$60,MATCH(Employee_Data!H39,MinimumWages!$A$1:$R$1,0),0),0)","v":0},0,{"$f":"ROUND(MAX(ROUNDUP(IF(K39>30000,K39/2,L39/3*2),-2),IFERROR(VLOOKUP(G39,MinimumWages!$A$1:$R$60,(MATCH(Employee_Data!H39,MinimumWages!$A$1:$R$1,0)-4),0),0)),0)","v":0},0,0,0,0,0,0,0,0,0,0,0,0,0,0,0,0,0,"-"]
[39,null,null,null,null,null,null,null,null,null,null,{"$f":"IFERROR(VLOOKUP(G40,MinimumWages!$A$1:$R$60,MATCH(Employee_Data!H40,MinimumWages!$A$1:$R$1,0),0),0)","v":0},0,{"$f":"ROUND(MAX(ROUNDUP(IF(K40>30000,K40/2,L40/3*2),-2),IFERROR(VLOOKUP(G40,MinimumWages!$A$1:$R$60,(MATCH(Employee_Data!H40,MinimumWages!$A$1:$R$1,0)-4),0),0)),0)","v":0},0,0,0,0,0,0,0,0,0,0,0,0,0,0,0,0,0,"-"]
[40,null,null,null,null,null,null,null,null,null,null,{"$f":"IFERROR(VLOOKUP(G41,MinimumWages!$A$1:$R$60,MATCH(Employee_Data!H41,MinimumWages!$A$1:$R$1,0),0),0)","v":0},0,{"$f":"ROUND(MAX(ROUNDUP(IF(K41>30000,K41/2,L41/3*2),-2),IFERROR(VLOOKUP(G41,MinimumWages!$A$1:$R$60,(MATCH(Employee_Data!H41,MinimumWages!$A$1:$R$1,0)-4),0),0)),0)","v":0},0,0,0,0,0,0,0,0,0,0,0,0,0,0,0,0,0,"-"]
[41,null,null,null,null,null,null,null,null,null,null,{"$f":"IFERROR(VLOOKUP(G42,MinimumWages!$A$1:$R$60,MATCH(Employee_Data!H42,MinimumWages!$A$1:$R$1,0),0),0)","v":0},0,{"$f":"ROUND(MAX(ROUNDUP(IF(K42>30000,K42/2,L42/3*2),-2),IFERROR(VLOOKUP(G42,MinimumWages!$A$1:$R$60,(MATCH(Employee_Data!H42,MinimumWages!$A$1:$R$1,0)-4),0),0)),0)","v":0},0,0,0,0,0,0,0,0,0,0,0,0,0,0,0,0,0,"-"]
[42,null,null,null,null,null,null,null,null,null,null,{"$f":"IFERROR(VLOOKUP(G43,MinimumWages!$A$1:$R$60,MATCH(Employee_Data!H43,MinimumWages!$A$1:$R$1,0),0),0)","v":0},0,{"$f":"ROUND(MAX(ROUNDUP(IF(K43>30000,K43/2,L43/3*2),-2),IFERROR(VLOOKUP(G43,MinimumWages!$A$1:$R$60,(MATCH(Employee_Data!H43,MinimumWages!$A$1:$R$1,0)-4),0),0)),0)","v":0},0,0,0,0,0,0,0,0,0,0,0,0,0,0,0,0,0,"-"]
[43,null,null,null,null,null,null,null,null,null,null,{"$f":"IFERROR(VLOOKUP(G44,MinimumWages!$A$1:$R$60,MATCH(Employee_Data!H44,MinimumWages!$A$1:$R$1,0),0),0)","v":0},0,{"$f":"ROUND(MAX(ROUNDUP(IF(K44>30000,K44/2,L44/3*2),-2),IFERROR(VLOOKUP(G44,MinimumWages!$A$1:$R$60,(MATCH(Employee_Data!H44,MinimumWages!$A$1:$R$1,0)-4),0),0)),0)","v":0},0,0,0,0,0,0,0,0,0,0,0,0,0,0,0,0,0,"-"]
[44,null,null,null,null,null,null,null,null,null,null,{"$f":"IFERROR(VLOOKUP(G45,MinimumWages!$A$1:$R$60,MATCH(Employee_Data!H45,MinimumWages!$A$1:$R$1,0),0),0)","v":0},0,{"$f":"ROUND(MAX(ROUNDUP(IF(K45>30000,K45/2,L45/3*2),-2),IFERROR(VLOOKUP(G45,MinimumWages!$A$1:$R$60,(MATCH(Employee_Data!H45,MinimumWages!$A$1:$R$1,0)-4),0),0)),0)","v":0},0,0,0,0,0,0,0,0,0,0,0,0,0,0,0,0,0,"-"]
[45,null,null,null,null,null,null,null,null,null,null,{"$f":"IFERROR(VLOOKUP(G46,MinimumWages!$A$1:$R$60,MATCH(Employee_Data!H46,MinimumWages!$A$1:$R$1,0),0),0)","v":0},0,{"$f":"ROUND(MAX(ROUNDUP(IF(K46>30000,K46/2,L46/3*2),-2),IFERROR(VLOOKUP(G46,MinimumWages!$A$1:$R$60,(MATCH(Employee_Data!H46,MinimumWages!$A$1:$R$1,0)-4),0),0)),0)","v":0},0,0,0,0,0,0,0,0,0,0,0,0,0,0,0,0,0,"-"]
[46,null,null,null,null,null,null,null,null,null,null,{"$f":"IFERROR(VLOOKUP(G47,MinimumWages!$A$1:$R$60,MATCH(Employee_Data!H47,MinimumWages!$A$1:$R$1,0),0),0)","v":0},0,{"$f":"ROUND(MAX(ROUNDUP(IF(K47>30000,K47/2,L47/3*2),-2),IFERROR(VLOOKUP(G47,MinimumWages!$A$1:$R$60,(MATCH(Employee_Data!H47,MinimumWages!$A$1:$R$1,0)-4),0),0)),0)","v":0},0,0,0,0,0,0,0,0,0,0,0,0,0,0,0,0,0,"-"]
[47,null,null,null,null,null,null,null,null,null,null,{"$f":"IFERROR(VLOOKUP(G48,MinimumWages!$A$1:$R$60,MATCH(Employee_Data!H48,MinimumWages!$A$1:$R$1,0),0),0)","v":0},0,{"$f":"ROUND(MAX(ROUNDUP(IF(K48>30000,K48/2,L48/3*2),-2),IFERROR(VLOOKUP(G48,MinimumWages!$A$1:$R$60,(MATCH(Employee_Data!H48,MinimumWages!$A$1:$R$1,0)-4),0),0)),0)","v":0},0,0,0,0,0,0,0,0,0,0,0,0,0,0,0,0,0,"-"]
[48,null,null,null,null,null,null,null,null,null,null,{"$f":"IFERROR(VLOOKUP(G49,MinimumWages!$A$1:$R$60,MATCH(Employee_Data!H49,MinimumWages!$A$1:$R$1,0),0),0)","v":0},0,{"$f":"ROUND(MAX(ROUNDUP(IF(K49>30000,K49/2,L49/3*2),-2),IFERROR(VLOOKUP(G49,MinimumWages!$A$1:$R$60,(MATCH(Employee_Data!H49,MinimumWages!$A$1:$R$1,0)-4),0),0)),0)","v":0},0,0,0,0,0,0,0,0,0,0,0,0,0,0,0,0,0,"-"]
[49,null,null,null,null,null,null,null,null,null,null,{"$f":"IFERROR(VLOOKUP(G50,MinimumWages!$A$1:$R$60,MATCH(Employee_Data!H50,MinimumWages!$A$1:$R$1,0),0),0)","v":0},0,{"$f":"ROUND(MAX(ROUNDUP(IF(K50>30000,K50/2,L50/3*2),-2),IFERROR(VLOOKUP(G50,MinimumWages!$A$1:$R$60,(MATCH(Employee_Data!H50,MinimumWages!$A$1:$R$1,0)-4),0),0)),0)","v":0},0,0,0,0,0,0,0,0,0,0,0,0,0,0,0,0,0,"-"]
[50,null,null,null,null,null,null,null,null,null,null,{"$f":"IFERROR(VLOOKUP(G51,MinimumWages!$A$1:$R$60,MATCH(Employee_Data!H51,MinimumWages!$A$1:$R$1,0),0),0)","v":0},0,{"$f":"ROUND(MAX(ROUNDUP(IF(K51>30000,K51/2,L51/3*2),-2),IFERROR(VLOOKUP(G51,MinimumWages!$A$1:$R$60,(MATCH(Employee_Data!H51,MinimumWages!$A$1:$R$1,0)-4),0),0)),0)","v":0},0,0,0,0,0,0,0,0,0,0,0,0,0,0,0,0,0,"-"]
[51,null,null,null,null,null,null,null,null,null,null,{"$f":"IFERROR(VLOOKUP(G52,MinimumWages!$A$1:$R$60,MATCH(Employee_Data!H52,MinimumWages!$A$1:$R$1,0),0),0)","v":0},0,{"$f":"ROUND(MAX(ROUNDUP(IF(K52>30000,K52/2,L52/3*2),-2),IFERROR(VLOOKUP(G52,MinimumWages!$A$1:$R$60,(MATCH(Employee_Data!H52,MinimumWages!$A$1:$R$1,0)-4),0),0)),0)","v":0},0,0,0,0,0,0,0,0,0,0,0,0,0,0,0,0,0,"-"]
[52,null,null,null,null,null,null,null,null,null,null,{"$f":"IFERROR(VLOOKUP(G53,MinimumWages!$A$1:$R$60,MATCH(Employee_Data!H53,MinimumWages!$A$1:$R$1,0),0),0)","v":0},0,{"$f":"ROUND(MAX(ROUNDUP(IF(K53>30000,K53/2,L53/3*2),-2),IFERROR(VLOOKUP(G53,MinimumWages!$A$1:$R$60,(MATCH(Employee_Data!H53,MinimumWages!$A$1:$R$1,0)-4),0),0)),0)","v":0},0,0,0,0,0,0,0,0,0,0,0,0,0,0,0,0,0,"-"]
[53,null,null,null,null,null,null,null,null,null,null,{"$f":"IFERROR(VLOOKUP(G54,MinimumWages!$A$1:$R$60,MATCH(Employee_Data!H54,MinimumWages!$A$1:$R$1,0),0),0)","v":0},0,{"$f":"ROUND(MAX(ROUNDUP(IF(K54>30000,K54/2,L54/3*2),-2),IFERROR(VLOOKUP(G54,MinimumWages!$A$1:$R$60,(MATCH(Employee_Data!H54,MinimumWages!$A$1:$R$1,0)-4),0),0)),0)","v":0},0,0,0,0,0,0,0,0,0,0,0,0,0,0,0,0,0,"-"]
[54,null,null,null,null,null,null,null,null,null,null,{"$f":"IFERROR(VLOOKUP(G55,MinimumWages!$A$1:$R$60,MATCH(Employee_Data!H55,MinimumWages!$A$1:$R$1,0),0),0)","v":0},0,{"$f":"ROUND(MAX(ROUNDUP(IF(K55>30000,K55/2,L55/3*2),-2),IFERROR(VLOOKUP(G55,MinimumWages!$A$1:$R$60,(MATCH(Employee_Data!H55,MinimumWages!$A$1:$R$1,0)-4),0),0)),0)","v":0},0,0,0,0,0,0,0,0,0,0,0,0,0,0,0,0,0,"-"]
[55,null,null,null,null,null,null,null,null,null,null,{"$f":"IFERROR(VLOOKUP(G56,MinimumWages!$A$1:$R$60,MATCH(Employee_Data!H56,MinimumWages!$A$1:$R$1,0),0),0)","v":0},0,{"$f":"ROUND(MAX(ROUNDUP(IF(K56>30000,K56/2,L56/3*2),-2),IFERROR(VLOOKUP(G56,MinimumWages!$A$1:$R$60,(MATCH(Employee_Data!H56,MinimumWages!$A$1:$R$1,0)-4),0),0)),0)","v":0},0,0,0,0,0,0,0,0,0,0,0,0,0,0,0,0,0,"-"]
[56,null,null,null,null,null,null,null,null,null,null,{"$f":"IFERROR(VLOOKUP(G57,MinimumWages!$A$1:$R$60,MATCH(Employee_Data!H57,MinimumWages!$A$1:$R$1,0),0),0)","v":0},0,{"$f":"ROUND(MAX(ROUNDUP(IF(K57>30000,K57/2,L57/3*2),-2),IFERROR(VLOOKUP(G57,MinimumWages!$A$1:$R$60,(MATCH(Employee_Data!H57,MinimumWages!$A$1:$R$1,0)-4),0),0)),0)","v":0},0,0,0,0,0,0,0,0,0,0,0,0,0,0,0,0,0,"-"]
[57,null,null,null,null,null,null,null,null,null,null,{"$f":"IFERROR(VLOOKUP(G58,MinimumWages!$A$1:$R$60,MATCH(Employee_Data!H58,MinimumWages!$A$1:$R$1,0),0),0)","v":0},0,{"$f":"ROUND(MAX(ROUNDUP(IF(K58>30000,K58/2,L58/3*2),-2),IFERROR(VLOOKUP(G58,MinimumWages!$A$1:$R$60,(MATCH(Employee_Data!H58,MinimumWages!$A$1:$R$1,0)-4),0),0)),0)","v":0},0,0,0,0,0,0,0,0,0,0,0,0,0,0,0,0,0,"-"]
[58,null,null,null,null,null,null,null,null,null,null,{"$f":"IFERROR(VLOOKUP(G59,MinimumWages!$A$1:$R$60,MATCH(Employee_Data!H59,MinimumWages!$A$1:$R$1,0),0),0)","v":0},0,{"$f":"ROUND(MAX(ROUNDUP(IF(K59>30000,K59/2,L59/3*2),-2),IFERROR(VLOOKUP(G59,MinimumWages!$A$1:$R$60,(MATCH(Employee_Data!H59,MinimumWages!$A$1:$R$1,0)-4),0),0)),0)","v":0},0,0,0,0,0,0,0,0,0,0,0,0,0,0,0,0,0,"-"]
[59,null,null,null,null,null,null,null,null,null,null,{"$f":"IFERROR(VLOOKUP(G60,MinimumWages!$A$1:$R$60,MATCH(Employee_Data!H60,MinimumWages!$A$1:$R$1,0),0),0)","v":0},0,{"$f":"ROUND(MAX(ROUNDUP(IF(K60>30000,K60/2,L60/3*2),-2),IFERROR(VLOOKUP(G60,MinimumWages!$A$1:$R$60,(MATCH(Employee_Data!H60,MinimumWages!$A$1:$R$1,0)-4),0),0)),0)","v":0},0,0,0,0,0,0,0,0,0,0,0,0,0,0,0,0,0,"-"]
[60,null,null,null,null,null,null,null,null,null,null,{"$f":"IFERROR(VLOOKUP(G61,MinimumWages!$A$1:$R$60,MATCH(Employee_Data!H61,MinimumWages!$A$1:$R$1,0),0),0)","v":0},0,{"$f":"ROUND(MAX(ROUNDUP(IF(K61>30000,K61/2,L61/3*2),-2),IFERROR(VLOOKUP(G61,MinimumWages!$A$1:$R$60,(MATCH(Employee_Data!H61,MinimumWages!$A$1:$R$1,0)-4),0),0)),0)","v":0},0,0,0,0,0,0,0,0,0,0,0,0,0,0,0,0,0,"-"]
[61,null,null,null,null,null,null,null,null,null,null,{"$f":"IFERROR(VLOOKUP(G62,MinimumWages!$A$1:$R$60,MATCH(Employee_Data!H62,MinimumWages!$A$1:$R$1,0),0),0)","v":0},0,{"$f":"ROUND(MAX(ROUNDUP(IF(K62>30000,K62/2,L62/3*2),-2),IFERROR(VLOOKUP(G62,MinimumWages!$A$1:$R$60,(MATCH(Employee_Data!H62,MinimumWages!$A$1:$R$1,0)-4),0),0)),0)","v":0},0,0,0,0,0,0,0,0,0,0,0,0,0,0,0,0,0,"-"]
[62,null,null,null,null,null,null,null,null,null,null,{"$f":"IFERROR(VLOOKUP(G63,MinimumWages!$A$1:$R$60,MATCH(Employee_Data!H63,MinimumWages!$A$1:$R$1,0),0),0)","v":0},0,{"$f":"ROUND(MAX(ROUNDUP(IF(K63>30000,K63/2,L63/3*2),-2),IFERROR(VLOOKUP(G63,MinimumWages!$A$1:$R$60,(MATCH(Employee_Data!H63,MinimumWages!$A$1:$R$1,0)-4),0),0)),0)","v":0},0,0,0,0,0,0,0,0,0,0,0,0,0,0,0,0,0,"-"]
[63,null,null,null,null,null,null,null,null,null,null,{"$f":"IFERROR(VLOOKUP(G64,MinimumWages!$A$1:$R$60,MATCH(Employee_Data!H64,MinimumWages!$A$1:$R$1,0),0),0)","v":0},0,{"$f":"ROUND(MAX(ROUNDUP(IF(K64>30000,K64/2,L64/3*2),-2),IFERROR(VLOOKUP(G64,MinimumWages!$A$1:$R$60,(MATCH(Employee_Data!H64,MinimumWages!$A$1:$R$1,0)-4),0),0)),0)","v":0},0,0,0,0,0,0,0,0,0,0,0,0,0,0,0,0,0,"-"]
[64,null,null,null,null,null,null,null,null,null,null,{"$f":"IFERROR(VLOOKUP(G65,MinimumWages!$A$1:$R$60,MATCH(Employee_Data!H65,MinimumWages!$A$1:$R$1,0),0),0)","v":0},0,{"$f":"ROUND(MAX(ROUNDUP(IF(K65>30000,K65/2,L65/3*2),-2),IFERROR(VLOOKUP(G65,MinimumWages!$A$1:$R$60,(MATCH(Employee_Data!H65,MinimumWages!$A$1:$R$1,0)-4),0),0)),0)","v":0},0,0,0,0,0,0,0,0,0,0,0,0,0,0,0,0,0,"-"]
[65,null,null,null,null,null,null,null,null,null,null,{"$f":"IFERROR(VLOOKUP(G66,MinimumWages!$A$1:$R$60,MATCH(Employee_Data!H66,MinimumWages!$A$1:$R$1,0),0),0)","v":0},0,{"$f":"ROUND(MAX(ROUNDUP(IF(K66>30000,K66/2,L66/3*2),-2),IFERROR(VLOOKUP(G66,MinimumWages!$A$1:$R$60,(MATCH(Employee_Data!H66,MinimumWages!$A$1:$R$1,0)-4),0),0)),0)","v":0},0,0,0,0,0,0,0,0,0,0,0,0,0,0,0,0,0,"-"]
[{"$f":"ROW()-1","v":66},null,null,null,null,null,null,null,null,null,null,{"$f":"IFERROR(VLOOKUP(G67,MinimumWages!$A$1:$R$60,MATCH(Employee_Data!H67,MinimumWages!$A$1:$R$1,0),0),0)","v":0},0,{"$f":"ROUND(MAX(ROUNDUP(IF(K67>30000,K67/2,L67/3*2),-2),IFERROR(VLOOKUP(G67,MinimumWages!$A$1:$R$60,(MATCH(Employee_Data!H67,MinimumWages!$A$1:$R$1,0)-4),0),0)),0)","v":0},0,0,0,0,0,0,0,0,0,0,0,0,0,0,0,{"$f":"ROUND(AC67*12,0)","v":0},0,"-"]
[67,null,null,null,null,null,null,null,null,null,null,{"$f":"IFERROR(VLOOKUP(G68,MinimumWages!$A$1:$R$60,MATCH(Employee_Data!H68,MinimumWages!$A$1:$R$1,0),0),0)","v":0},0,{"$f":"ROUND(MAX(ROUNDUP(IF(K68>30000,K68/2,L68/3*2),-2),IFERROR(VLOOKUP(G68,MinimumWages!$A$1:$R$60,(MATCH(Employee_Data!H68,MinimumWages!$A$1:$R$1,0)-4),0),0)),0)","v":0},0,0,0,0,0,0,0,0,0,0,0,0,0,0,0,0,0,"-"]
[68,null,null,null,null,null,null,null,null,null,null,{"$f":"IFERROR(VLOOKUP(G69,MinimumWages!$A$1:$R$60,MATCH(Employee_Data!H69,MinimumWages!$A$1:$R$1,0),0),0)","v":0},0,{"$f":"ROUND(MAX(ROUNDUP(IF(K69>30000,K69/2,L69/3*2),-2),IFERROR(VLOOKUP(G69,MinimumWages!$A$1:$R$60,(MATCH(Employee_Data!H69,MinimumWages!$A$1:$R$1,0)-4),0),0)),0)","v":0},0,0,0,0,0,0,0,0,0,0,0,0,0,0,0,0,0,"-"]
[69,null,null,null,null,null,null,null,null,null,null,{"$f":"IFERROR(VLOOKUP(G70,MinimumWages!$A$1:$R$60,MATCH(Employee_Data!H70,MinimumWages!$A$1:$R$1,0),0),0)","v":0},0,{"$f":"ROUND(MAX(ROUNDUP(IF(K70>30000,K70/2,L70/3*2),-2),IFERROR(VLOOKUP(G70,MinimumWages!$A$1:$R$60,(MATCH(Employee_Data!H70,MinimumWages!$A$1:$R$1,0)-4),0),0)),0)","v":0},0,0,0,0,0,0,0,0,0,0,0,0,0,0,0,0,0,"-"]
[70,null,null,null,null,null,null,null,null,null,null,{"$f":"IFERROR(VLOOKUP(G71,MinimumWages!$A$1:$R$60,MATCH(Employee_Data!H71,MinimumWages!$A$1:$R$1,0),0),0)","v":0},0,{"$f":"ROUND(MAX(ROUNDUP(IF(K71>30000,K71/2,L71/3*2),-2),IFERROR(VLOOKUP(G71,MinimumWages!$A$1:$R$60,(MATCH(Employee_Data!H71,MinimumWages!$A$1:$R$1,0)-4),0),0)),0)","v":0},0,0,0,0,0,0,0,0,0,0,0,0,0,0,0,0,0,"-"]
[71,null,null,null,null,null,null,null,null,null,null,{"$f":"IFERROR(VLOOKUP(G72,MinimumWages!$A$1:$R$60,MATCH(Employee_Data!H72,MinimumWages!$A$1:$R$1,0),0),0)","v":0},0,{"$f":"ROUND(MAX(ROUNDUP(IF(K72>30000,K72/2,L72/3*2),-2),IFERROR(VLOOKUP(G72,MinimumWages!$A$1:$R$60,(MATCH(Employee_Data!H72,MinimumWages!$A$1:$R$1,0)-4),0),0)),0)","v":0},0,0,0,0,0,0,0,0,0,0,0,0,0,0,0,0,0,"-"]
[72,null,null,null,null,null,null,null,null,null,null,{"$f":"IFERROR(VLOOKUP(G73,MinimumWages!$A$1:$R$60,MATCH(Employee_Data!H73,MinimumWages!$A$1:$R$1,0),0),0)","v":0},0,{"$f":"ROUND(MAX(ROUNDUP(IF(K73>30000,K73/2,L73/3*2),-2),IFERROR(VLOOKUP(G73,MinimumWages!$A$1:$R$60,(MATCH(Employee_Data!H73,MinimumWages!$A$1:$R$1,0)-4),0),0)),0)","v":0},0,0,0,0,0,0,0,0,0,0,0,0,0,0,0,0,0,"-"]
[73,null,null,null,null,null,null,null,null,null,null,{"$f":"IFERROR(VLOOKUP(G74,MinimumWages!$A$1:$R$60,MATCH(Employee_Data!H74,MinimumWages!$A$1:$R$1,0),0),0)","v":0},0,{"$f":"ROUND(MAX(ROUNDUP(IF(K74>30000,K74/2,L74/3*2),-2),IFERROR(VLOOKUP(G74,MinimumWages!$A$1:$R$60,(MATCH(Employee_Data!H74,MinimumWages!$A$1:$R$1,0)-4),0),0)),0)","v":0},0,0,0,0,0,0,0,0,0,0,0,0,0,0,0,0,0,"-"]
[74,null,null,null,null,null,null,null,null,null,null,{"$f":"IFERROR(VLOOKUP(G75,MinimumWages!$A$1:$R$60,MATCH(Employee_Data!H75,MinimumWages!$A$1:$R$1,0),0),0)","v":0},0,{"$f":"ROUND(MAX(ROUNDUP(IF(K75>30000,K75/2,L75/3*2),-2),IFERROR(VLOOKUP(G75,MinimumWages!$A$1:$R$60,(MATCH(Employee_Data!H75,MinimumWages!$A$1:$R$1,0)-4),0),0)),0)","v":0},0,0,0,0,0,0,0,0,0,0,0,0,0,0,0,0,0,"-"]
[75,null,null,null,null,null,null,null,null,null,null,{"$f":"IFERROR(VLOOKUP(G76,MinimumWages!$A$1:$R$60,MATCH(Employee_Data!H76,MinimumWages!$A$1:$R$1,0),0),0)","v":0},0,{"$f":"ROUND(MAX(ROUNDUP(IF(K76>30000,K76/2,L76/3*2),-2),IFERROR(VLOOKUP(G76,MinimumWages!$A$1:$R$60,(MATCH(Employee_Data!H76,MinimumWages!$A$1:$R$1,0)-4),0),0)),0)","v":0},0,0,0,0,0,0,0,0,0,0,0,0,0,0,0,0,0,"-"]
[76,null,null,null,null,null,null,null,null,null,null,{"$f":"IFERROR(VLOOKUP(G77,MinimumWages!$A$1:$R$60,MATCH(Employee_Data!H77,MinimumWages!$A$1:$R$1,0),0),0)","v":0},0,{"$f":"ROUND(MAX(ROUNDUP(IF(K77>30000,K77/2,L77/3*2),-2),IFERROR(VLOOKUP(G77,MinimumWages!$A$1:$R$60,(MATCH(Employee_Data!H77,MinimumWages!$A$1:$R$1,0)-4),0),0)),0)","v":0},0,0,0,0,0,0,0,0,0,0,0,0,0,0,0,0,0,"-"]
[77,null,null,null,null,null,null,null,null,null,null,{"$f":"IFERROR(VLOOKUP(G78,MinimumWages!$A$1:$R$60,MATCH(Employee_Data!H78,MinimumWages!$A$1:$R$1,0),0),0)","v":0},0,{"$f":"ROUND(MAX(ROUNDUP(IF(K78>30000,K78/2,L78/3*2),-2),IFERROR(VLOOKUP(G78,MinimumWages!$A$1:$R$60,(MATCH(Employee_Data!H78,MinimumWages!$A$1:$R$1,0)-4),0),0)),0)","v":0},0,0,0,0,0,0,0,0,0,0,0,0,0,0,0,0,0,"-"]
[78,null,null,null,null,null,null,null,null,null,null,{"$f":"IFERROR(VLOOKUP(G79,MinimumWages!$A$1:$R$60,MATCH(Employee_Data!H79,MinimumWages!$A$1:$R$1,0),0),0)","v":0},0,{"$f":"ROUND(MAX(ROUNDUP(IF(K79>30000,K79/2,L79/3*2),-2),IFERROR(VLOOKUP(G79,MinimumWages!$A$1:$R$60,(MATCH(Employee_Data!H79,MinimumWages!$A$1:$R$1,0)-4),0),0)),0)","v":0},0,0,0,0,0,0,0,0,0,0,0,0,0,0,0,0,0,"-"]
[79,null,null,null,null,null,null,null,null,null,null,{"$f":"IFERROR(VLOOKUP(G80,MinimumWages!$A$1:$R$60,MATCH(Employee_Data!H80,MinimumWages!$A$1:$R$1,0),0),0)","v":0},0,{"$f":"ROUND(MAX(ROUNDUP(IF(K80>30000,K80/2,L80/3*2),-2),IFERROR(VLOOKUP(G80,MinimumWages!$A$1:$R$60,(MATCH(Employee_Data!H80,MinimumWages!$A$1:$R$1,0)-4),0),0)),0)","v":0},0,0,0,0,0,0,0,0,0,0,0,0,0,0,0,0,0,"-"]
[80,null,null,null,null,null,null,null,null,null,null,{"$f":"IFERROR(VLOOKUP(G81,MinimumWages!$A$1:$R$60,MATCH(Employee_Data!H81,MinimumWages!$A$1:$R$1,0),0),0)","v":0},0,{"$f":"ROUND(MAX(ROUNDUP(IF(K81>30000,K81/2,L81/3*2),-2),IFERROR(VLOOKUP(G81,MinimumWages!$A$1:$R$60,(MATCH(Employee_Data!H81,MinimumWages!$A$1:$R$1,0)-4),0),0)),0)","v":0},0,0,0,0,0,0,0,0,0,0,0,0,0,0,0,0,0,"-"]
[81,null,null,null,null,null,null,null,null,null,null,{"$f":"IFERROR(VLOOKUP(G82,MinimumWages!$A$1:$R$60,MATCH(Employee_Data!H82,MinimumWages!$A$1:$R$1,0),0),0)","v":0},0,{"$f":"ROUND(MAX(ROUNDUP(IF(K82>30000,K82/2,L82/3*2),-2),IFERROR(VLOOKUP(G82,MinimumWages!$A$1:$R$60,(MATCH(Employee_Data!H82,MinimumWages!$A$1:$R$1,0)-4),0),0)),0)","v":0},0,0,0,0,0,0,0,0,0,0,0,0,0,0,0,0,0,"-"]
[82,null,null,null,null,null,null,null,null,null,null,{"$f":"IFERROR(VLOOKUP(G83,MinimumWages!$A$1:$R$60,MATCH(Employee_Data!H83,MinimumWages!$A$1:$R$1,0),0),0)","v":0},0,{"$f":"ROUND(MAX(ROUNDUP(IF(K83>30000,K83/2,L83/3*2),-2),IFERROR(VLOOKUP(G83,MinimumWages!$A$1:$R$60,(MATCH(Employee_Data!H83,MinimumWages!$A$1:$R$1,0)-4),0),0)),0)","v":0},0,0,0,0,0,0,0,0,0,0,0,0,0,0,0,0,0,"-"]
[83,null,null,null,null,null,null,null,null,null,null,{"$f":"IFERROR(VLOOKUP(G84,MinimumWages!$A$1:$R$60,MATCH(Employee_Data!H84,MinimumWages!$A$1:$R$1,0),0),0)","v":0},0,{"$f":"ROUND(MAX(ROUNDUP(IF(K84>30000,K84/2,L84/3*2),-2),IFERROR(VLOOKUP(G84,MinimumWages!$A$1:$R$60,(MATCH(Employee_Data!H84,MinimumWages!$A$1:$R$1,0)-4),0),0)),0)","v":0},0,0,0,0,0,0,0,0,0,0,0,0,0,0,0,0,0,"-"]
[84,null,null,null,null,null,null,null,null,null,null,{"$f":"IFERROR(VLOOKUP(G85,MinimumWages!$A$1:$R$60,MATCH(Employee_Data!H85,MinimumWages!$A$1:$R$1,0),0),0)","v":0},0,{"$f":"ROUND(MAX(ROUNDUP(IF(K85>30000,K85/2,L85/3*2),-2),IFERROR(VLOOKUP(G85,MinimumWages!$A$1:$R$60,(MATCH(Employee_Data!H85,MinimumWages!$A$1:$R$1,0)-4),0),0)),0)","v":0},0,0,0,0,0,0,0,0,0,0,0,0,0,0,0,0,0,"-"]
[85,null,null,null,null,null,null,null,null,null,null,{"$f":"IFERROR(VLOOKUP(G86,MinimumWages!$A$1:$R$60,MATCH(Employee_Data!H86,MinimumWages!$A$1:$R$1,0),0),0)","v":0},0,{"$f":"ROUND(MAX(ROUNDUP(IF(K86>30000,K86/2,L86/3*2),-2),IFERROR(VLOOKUP(G86,MinimumWages!$A$1:$R$60,(MATCH(Employee_Data!H86,MinimumWages!$A$1:$R$1,0)-4),0),0)),0)","v":0},0,0,0,0,0,0,0,0,0,0,0,0,0,0,0,0,0,"-"]
[86,null,null,null,null,null,null,null,null,null,null,{"$f":"IFERROR(VLOOKUP(G87,MinimumWages!$A$1:$R$60,MATCH(Employee_Data!H87,MinimumWages!$A$1:$R$1,0),0),0)","v":0},0,{"$f":"ROUND(MAX(ROUNDUP(IF(K87>30000,K87/2,L87/3*2),-2),IFERROR(VLOOKUP(G87,MinimumWages!$A$1:$R$60,(MATCH(Employee_Data!H87,MinimumWages!$A$1:$R$1,0)-4),0),0)),0)","v":0},0,0,0,0,0,0,0,0,0,0,0,0,0,0,0,0,0,"-"]
[87,null,null,null,null,null,null,null,null,null,null,{"$f":"IFERROR(VLOOKUP(G88,MinimumWages!$A$1:$R$60,MATCH(Employee_Data!H88,MinimumWages!$A$1:$R$1,0),0),0)","v":0},0,{"$f":"ROUND(MAX(ROUNDUP(IF(K88>30000,K88/2,L88/3*2),-2),IFERROR(VLOOKUP(G88,MinimumWages!$A$1:$R$60,(MATCH(Employee_Data!H88,MinimumWages!$A$1:$R$1,0)-4),0),0)),0)","v":0},0,0,0,0,0,0,0,0,0,0,0,0,0,0,0,0,0,"-"]
[88,null,null,null,null,null,null,null,null,null,null,{"$f":"IFERROR(VLOOKUP(G89,MinimumWages!$A$1:$R$60,MATCH(Employee_Data!H89,MinimumWages!$A$1:$R$1,0),0),0)","v":0},0,{"$f":"ROUND(MAX(ROUNDUP(IF(K89>30000,K89/2,L89/3*2),-2),IFERROR(VLOOKUP(G89,MinimumWages!$A$1:$R$60,(MATCH(Employee_Data!H89,MinimumWages!$A$1:$R$1,0)-4),0),0)),0)","v":0},0,0,0,0,0,0,0,0,0,0,0,0,0,0,0,0,0,"-"]
[89,null,null,null,null,null,null,null,null,null,null,{"$f":"IFERROR(VLOOKUP(G90,MinimumWages!$A$1:$R$60,MATCH(Employee_Data!H90,MinimumWages!$A$1:$R$1,0),0),0)","v":0},0,{"$f":"ROUND(MAX(ROUNDUP(IF(K90>30000,K90/2,L90/3*2),-2),IFERROR(VLOOKUP(G90,MinimumWages!$A$1:$R$60,(MATCH(Employee_Data!H90,MinimumWages!$A$1:$R$1,0)-4),0),0)),0)","v":0},0,0,0,0,0,0,0,0,0,0,0,0,0,0,0,0,0,"-"]
[90,null,null,null,null,null,null,null,null,null,null,{"$f":"IFERROR(VLOOKUP(G91,MinimumWages!$A$1:$R$60,MATCH(Employee_Data!H91,MinimumWages!$A$1:$R$1,0),0),0)","v":0},0,{"$f":"ROUND(MAX(ROUNDUP(IF(K91>30000,K91/2,L91/3*2),-2),IFERROR(VLOOKUP(G91,MinimumWages!$A$1:$R$60,(MATCH(Employee_Data!H91,MinimumWages!$A$1:$R$1,0)-4),0),0)),0)","v":0},0,0,0,0,0,0,0,0,0,0,0,0,0,0,0,0,0,"-"]
[91,null,null,null,null,null,null,null,null,null,null,{"$f":"IFERROR(VLOOKUP(G92,MinimumWages!$A$1:$R$60,MATCH(Employee_Data!H92,MinimumWages!$A$1:$R$1,0),0),0)","v":0},0,{"$f":"ROUND(MAX(ROUNDUP(IF(K92>30000,K92/2,L92/3*2),-2),IFERROR(VLOOKUP(G92,MinimumWages!$A$1:$R$60,(MATCH(Employee_Data!H92,MinimumWages!$A$1:$R$1,0)-4),0),0)),0)","v":0},0,0,0,0,0,0,0,0,0,0,0,0,0,0,0,0,0,"-"]
[92,null,null,null,null,null,null,null,null,null,null,{"$f":"IFERROR(VLOOKUP(G93,MinimumWages!$A$1:$R$60,MATCH(Employee_Data!H93,MinimumWages!$A$1:$R$1,0),0),0)","v":0},0,{"$f":"ROUND(MAX(ROUNDUP(IF(K93>30000,K93/2,L93/3*2),-2),IFERROR(VLOOKUP(G93,MinimumWages!$A$1:$R$60,(MATCH(Employee_Data!H93,MinimumWages!$A$1:$R$1,0)-4),0),0)),0)","v":0},0,0,0,0,0,0,0,0,0,0,0,0,0,0,0,0,0,"-"]
[93,null,null,null,null,null,null,null,null,null,null,{"$f":"IFERROR(VLOOKUP(G94,MinimumWages!$A$1:$R$60,MATCH(Employee_Data!H94,MinimumWages!$A$1:$R$1,0),0),0)","v":0},0,{"$f":"ROUND(MAX(ROUNDUP(IF(K94>30000,K94/2,L94/3*2),-2),IFERROR(VLOOKUP(G94,MinimumWages!$A$1:$R$60,(MATCH(Employee_Data!H94,MinimumWages!$A$1:$R$1,0)-4),0),0)),0)","v":0},0,0,0,0,0,0,0,0,0,0,0,0,0,0,0,0,0,"-"]
[94,null,null,null,null,null,null,null,null,null,null,{"$f":"IFERROR(VLOOKUP(G95,MinimumWages!$A$1:$R$60,MATCH(Employee_Data!H95,MinimumWages!$A$1:$R$1,0),0),0)","v":0},{"$f":"ROUND(K95*12,0)","v":0},{"$f":"ROUND(MAX(ROUNDUP(IF(K95>30000,K95/2,L95/3*2),-2),IFERROR(VLOOKUP(G95,MinimumWages!$A$1:$R$60,(MATCH(Employee_Data!H95,MinimumWages!$A$1:$R$1,0)-4),0),0)),0)","v":0},{"$f":"ROUND(IF(K95<30000,N95*5%,N95/2),0)","v":0},0,0,0,0,0,0,{"$f":"SUM(N95:U95)","v":0},{"$f":"IF(I95=\"Yes\",ROUND(IF(J95=\"Limit\",MIN((V95-O95),15000),IF(N95>15000,N95,MIN((V95-O95),15000)))*12%,0),0)","v":0},{"$f":"IF(V95>21000,0,ROUNDUP(V95*3.75%,0))","v":0},{"$f":"SUM(V95:X95)","v":0},{"$f":"IF(AND(N95<=21000,K95>0),ROUND(MAX(L95,7000)*8.33%,0),0)","v":0},{"$f":"ROUND(N95/26*15/12,0)","v":0},0,{"$f":"SUM(Y95:AB95)","v":0},0,{"$f":"ROUND((M95-AD95)/12,0)","v":0},{"$f":"IF(AE95<>0,\"Un-Matched CTC\",IF(COUNTIF(N95:AE95,\"<0\")>0,\"Less CTC\",\"-\"))","v":"-"}]
[95,null,null,null,null,null,null,null,null,null,null,{"$f":"IFERROR(VLOOKUP(G96,MinimumWages!$A$1:$R$60,MATCH(Employee_Data!H96,MinimumWages!$A$1:$R$1,0),0),0)","v":0},0,{"$f":"ROUND(MAX(ROUNDUP(IF(K96>30000,K96/2,L96/3*2),-2),IFERROR(VLOOKUP(G96,MinimumWages!$A$1:$R$60,(MATCH(Employee_Data!H96,MinimumWages!$A$1:$R$1,0)-4),0),0)),0)","v":0},0,0,0,0,0,0,0,0,0,0,0,0,0,0,0,0,0,"-"]
[96,null,null,null,null,null,null,null,null,null,null,{"$f":"IFERROR(VLOOKUP(G97,MinimumWages!$A$1:$R$60,MATCH(Employee_Data!H97,MinimumWages!$A$1:$R$1,0),0),0)","v":0},0,{"$f":"ROUND(MAX(ROUNDUP(IF(K97>30000,K97/2,L97/3*2),-2),IFERROR(VLOOKUP(G97,MinimumWages!$A$1:$R$60,(MATCH(Employee_Data!H97,MinimumWages!$A$1:$R$1,0)-4),0),0)),0)","v":0},0,0,0,0,0,0,0,0,0,0,0,0,0,0,0,0,0,"-"]
[97,null,null,null,null,null,null,null,null,null,null,{"$f":"IFERROR(VLOOKUP(G98,MinimumWages!$A$1:$R$60,MATCH(Employee_Data!H98,MinimumWages!$A$1:$R$1,0),0),0)","v":0},0,{"$f":"ROUND(MAX(ROUNDUP(IF(K98>30000,K98/2,L98/3*2),-2),IFERROR(VLOOKUP(G98,MinimumWages!$A$1:$R$60,(MATCH(Employee_Data!H98,MinimumWages!$A$1:$R$1,0)-4),0),0)),0)","v":0},0,0,0,0,0,0,0,0,0,0,0,0,0,0,0,0,0,"-"]
[98,null,null,null,null,null,null,null,null,null,null,{"$f":"IFERROR(VLOOKUP(G99,MinimumWages!$A$1:$R$60,MATCH(Employee_Data!H99,MinimumWages!$A$1:$R$1,0),0),0)","v":0},0,{"$f":"ROUND(MAX(ROUNDUP(IF(K99>30000,K99/2,L99/3*2),-2),IFERROR(VLOOKUP(G99,MinimumWages!$A$1:$R$60,(MATCH(Employee_Data!H99,MinimumWages!$A$1:$R$1,0)-4),0),0)),0)","v":0},0,0,0,0,0,0,0,0,0,0,0,0,0,0,0,0,0,"-"]
[99,null,null,null,null,null,null,null,null,null,null,{"$f":"IFERROR(VLOOKUP(G100,MinimumWages!$A$1:$R$60,MATCH(Employee_Data!H100,MinimumWages!$A$1:$R$1,0),0),0)","v":0},0,{"$f":"ROUND(MAX(ROUNDUP(IF(K100>30000,K100/2,L100/3*2),-2),IFERROR(VLOOKUP(G100,MinimumWages!$A$1:$R$60,(MATCH(Employee_Data!H100,MinimumWages!$A$1:$R$1,0)-4),0),0)),0)","v":0},0,0,0,0,0,0,0,0,0,0,0,0,0,0,0,0,0,"-"]
[100,null,null,null,null,null,null,null,null,null,null,{"$f":"IFERROR(VLOOKUP(G101,MinimumWages!$A$1:$R$60,MATCH(Employee_Data!H101,MinimumWages!$A$1:$R$1,0),0),0)","v":0},0,{"$f":"ROUND(MAX(ROUNDUP(IF(K101>30000,K101/2,L101/3*2),-2),IFERROR(VLOOKUP(G101,MinimumWages!$A$1:$R$60,(MATCH(Employee_Data!H101,MinimumWages!$A$1:$R$1,0)-4),0),0)),0)","v":0},0,0,0,0,0,0,0,0,0,0,0,0,0,0,0,0,0,"-"]
[101,null,null,null,null,null,null,null,null,null,null,{"$f":"IFERROR(VLOOKUP(G102,MinimumWages!$A$1:$R$60,MATCH(Employee_Data!H102,MinimumWages!$A$1:$R$1,0),0),0)","v":0},0,{"$f":"ROUND(MAX(ROUNDUP(IF(K102>30000,K102/2,L102/3*2),-2),IFERROR(VLOOKUP(G102,MinimumWages!$A$1:$R$60,(MATCH(Employee_Data!H102,MinimumWages!$A$1:$R$1,0)-4),0),0)),0)","v":0},0,0,0,0,0,0,0,0,0,0,0,0,0,0,0,0,0,"-"]
[102,null,null,null,null,null,null,null,null,null,null,{"$f":"IFERROR(VLOOKUP(G103,MinimumWages!$A$1:$R$60,MATCH(Employee_Data!H103,MinimumWages!$A$1:$R$1,0),0),0)","v":0},0,{"$f":"ROUND(MAX(ROUNDUP(IF(K103>30000,K103/2,L103/3*2),-2),IFERROR(VLOOKUP(G103,MinimumWages!$A$1:$R$60,(MATCH(Employee_Data!H103,MinimumWages!$A$1:$R$1,0)-4),0),0)),0)","v":0},0,0,0,0,0,0,0,0,0,0,0,0,0,0,0,0,0,"-"]
[103,null,null,null,null,null,null,null,null,null,null,{"$f":"IFERROR(VLOOKUP(G104,MinimumWages!$A$1:$R$60,MATCH(Employee_Data!H104,MinimumWages!$A$1:$R$1,0),0),0)","v":0},0,{"$f":"ROUND(MAX(ROUNDUP(IF(K104>30000,K104/2,L104/3*2),-2),IFERROR(VLOOKUP(G104,MinimumWages!$A$1:$R$60,(MATCH(Employee_Data!H104,MinimumWages!$A$1:$R$1,0)-4),0),0)),0)","v":0},0,0,0,0,0,0,0,0,0,0,0,0,0,0,0,0,0,"-"]
[104,null,null,null,null,null,null,null,null,null,null,{"$f":"IFERROR(VLOOKUP(G105,MinimumWages!$A$1:$R$60,MATCH(Employee_Data!H105,MinimumWages!$A$1:$R$1,0),0),0)","v":0},0,{"$f":"ROUND(MAX(ROUNDUP(IF(K105>30000,K105/2,L105/3*2),-2),IFERROR(VLOOKUP(G105,MinimumWages!$A$1:$R$60,(MATCH(Employee_Data!H105,MinimumWages!$A$1:$R$1,0)-4),0),0)),0)","v":0},0,0,0,0,0,0,0,0,0,0,0,0,0,0,0,0,0,"-"]
[105,null,null,null,null,null,null,null,null,null,null,{"$f":"IFERROR(VLOOKUP(G106,MinimumWages!$A$1:$R$60,MATCH(Employee_Data!H106,MinimumWages!$A$1:$R$1,0),0),0)","v":0},0,{"$f":"ROUND(MAX(ROUNDUP(IF(K106>30000,K106/2,L106/3*2),-2),IFERROR(VLOOKUP(G106,MinimumWages!$A$1:$R$60,(MATCH(Employee_Data!H106,MinimumWages!$A$1:$R$1,0)-4),0),0)),0)","v":0},0,0,0,0,0,0,0,0,0,0,0,0,0,0,0,0,0,"-"]
[106,null,null,null,null,null,null,null,null,null,null,{"$f":"IFERROR(VLOOKUP(G107,MinimumWages!$A$1:$R$60,MATCH(Employee_Data!H107,MinimumWages!$A$1:$R$1,0),0),0)","v":0},0,{"$f":"ROUND(MAX(ROUNDUP(IF(K107>30000,K107/2,L107/3*2),-2),IFERROR(VLOOKUP(G107,MinimumWages!$A$1:$R$60,(MATCH(Employee_Data!H107,MinimumWages!$A$1:$R$1,0)-4),0),0)),0)","v":0},0,0,0,0,0,0,0,0,0,0,0,0,0,0,0,0,0,"-"]
[107,null,null,null,null,null,null,null,null,null,null,{"$f":"IFERROR(VLOOKUP(G108,MinimumWages!$A$1:$R$60,MATCH(Employee_Data!H108,MinimumWages!$A$1:$R$1,0),0),0)","v":0},0,{"$f":"ROUND(MAX(ROUNDUP(IF(K108>30000,K108/2,L108/3*2),-2),IFERROR(VLOOKUP(G108,MinimumWages!$A$1:$R$60,(MATCH(Employee_Data!H108,MinimumWages!$A$1:$R$1,0)-4),0),0)),0)","v":0},0,0,0,0,0,0,0,0,0,0,0,0,0,0,0,0,0,"-"]
[108,null,null,null,null,null,null,null,null,null,null,{"$f":"IFERROR(VLOOKUP(G109,MinimumWages!$A$1:$R$60,MATCH(Employee_Data!H109,MinimumWages!$A$1:$R$1,0),0),0)","v":0},0,{"$f":"ROUND(MAX(ROUNDUP(IF(K109>30000,K109/2,L109/3*2),-2),IFERROR(VLOOKUP(G109,MinimumWages!$A$1:$R$60,(MATCH(Employee_Data!H109,MinimumWages!$A$1:$R$1,0)-4),0),0)),0)","v":0},0,0,0,0,0,0,0,0,0,0,0,0,0,0,0,0,0,"-"]
[109,null,null,null,null,null,null,null,null,null,null,{"$f":"IFERROR(VLOOKUP(G110,MinimumWages!$A$1:$R$60,MATCH(Employee_Data!H110,MinimumWages!$A$1:$R$1,0),0),0)","v":0},0,{"$f":"ROUND(MAX(ROUNDUP(IF(K110>30000,K110/2,L110/3*2),-2),IFERROR(VLOOKUP(G110,MinimumWages!$A$1:$R$60,(MATCH(Employee_Data!H110,MinimumWages!$A$1:$R$1,0)-4),0),0)),0)","v":0},0,0,0,0,0,0,0,0,0,0,0,0,0,0,0,0,0,"-"]
[110,null,null,null,null,null,null,null,null,null,null,{"$f":"IFERROR(VLOOKUP(G111,MinimumWages!$A$1:$R$60,MATCH(Employee_Data!H111,MinimumWages!$A$1:$R$1,0),0),0)","v":0},0,{"$f":"ROUND(MAX(ROUNDUP(IF(K111>30000,K111/2,L111/3*2),-2),IFERROR(VLOOKUP(G111,MinimumWages!$A$1:$R$60,(MATCH(Employee_Data!H111,MinimumWages!$A$1:$R$1,0)-4),0),0)),0)","v":0},0,0,0,0,0,0,0,0,0,0,0,0,0,0,0,0,0,"-"]
[111,null,null,null,null,null,null,null,null,null,null,{"$f":"IFERROR(VLOOKUP(G112,MinimumWages!$A$1:$R$60,MATCH(Employee_Data!H112,MinimumWages!$A$1:$R$1,0),0),0)","v":0},0,{"$f":"ROUND(MAX(ROUNDUP(IF(K112>30000,K112/2,L112/3*2),-2),IFERROR(VLOOKUP(G112,MinimumWages!$A$1:$R$60,(MATCH(Employee_Data!H112,MinimumWages!$A$1:$R$1,0)-4),0),0)),0)","v":0},0,0,0,0,0,0,0,0,0,0,0,0,0,0,0,0,0,"-"]
[112,null,null,null,null,null,null,null,null,null,null,{"$f":"IFERROR(VLOOKUP(G113,MinimumWages!$A$1:$R$60,MATCH(Employee_Data!H113,MinimumWages!$A$1:$R$1,0),0),0)","v":0},0,{"$f":"ROUND(MAX(ROUNDUP(IF(K113>30000,K113/2,L113/3*2),-2),IFERROR(VLOOKUP(G113,MinimumWages!$A$1:$R$60,(MATCH(Employee_Data!H113,MinimumWages!$A$1:$R$1,0)-4),0),0)),0)","v":0},0,0,0,0,0,0,0,0,0,0,0,0,0,0,0,0,0,"-"]
[113,null,null,null,null,null,null,null,null,null,null,{"$f":"IFERROR(VLOOKUP(G114,MinimumWages!$A$1:$R$60,MATCH(Employee_Data!H114,MinimumWages!$A$1:$R$1,0),0),0)","v":0},0,{"$f":"ROUND(MAX(ROUNDUP(IF(K114>30000,K114/2,L114/3*2),-2),IFERROR(VLOOKUP(G114,MinimumWages!$A$1:$R$60,(MATCH(Employee_Data!H114,MinimumWages!$A$1:$R$1,0)-4),0),0)),0)","v":0},0,0,0,0,0,0,0,0,0,0,0,0,0,0,0,0,0,"-"]
[114,null,null,null,null,null,null,null,null,null,null,{"$f":"IFERROR(VLOOKUP(G115,MinimumWages!$A$1:$R$60,MATCH(Employee_Data!H115,MinimumWages!$A$1:$R$1,0),0),0)","v":0},0,{"$f":"ROUND(MAX(ROUNDUP(IF(K115>30000,K115/2,L115/3*2),-2),IFERROR(VLOOKUP(G115,MinimumWages!$A$1:$R$60,(MATCH(Employee_Data!H115,MinimumWages!$A$1:$R$1,0)-4),0),0)),0)","v":0},0,0,0,0,0,0,0,0,0,0,0,0,0,0,0,0,0,"-"]
[115,null,null,null,null,null,null,null,null,null,null,{"$f":"IFERROR(VLOOKUP(G116,MinimumWages!$A$1:$R$60,MATCH(Employee_Data!H116,MinimumWages!$A$1:$R$1,0),0),0)","v":0},0,{"$f":"ROUND(MAX(ROUNDUP(IF(K116>30000,K116/2,L116/3*2),-2),IFERROR(VLOOKUP(G116,MinimumWages!$A$1:$R$60,(MATCH(Employee_Data!H116,MinimumWages!$A$1:$R$1,0)-4),0),0)),0)","v":0},0,0,0,0,0,0,0,0,0,0,0,0,0,0,0,0,0,"-"]
[116,null,null,null,null,null,null,null,null,null,null,{"$f":"IFERROR(VLOOKUP(G117,MinimumWages!$A$1:$R$60,MATCH(Employee_Data!H117,MinimumWages!$A$1:$R$1,0),0),0)","v":0},0,{"$f":"ROUND(MAX(ROUNDUP(IF(K117>30000,K117/2,L117/3*2),-2),IFERROR(VLOOKUP(G117,MinimumWages!$A$1:$R$60,(MATCH(Employee_Data!H117,MinimumWages!$A$1:$R$1,0)-4),0),0)),0)","v":0},0,0,0,0,0,0,0,0,0,0,0,0,0,0,0,0,0,"-"]
[117,null,null,null,null,null,null,null,null,null,null,{"$f":"IFERROR(VLOOKUP(G118,MinimumWages!$A$1:$R$60,MATCH(Employee_Data!H118,MinimumWages!$A$1:$R$1,0),0),0)","v":0},0,{"$f":"ROUND(MAX(ROUNDUP(IF(K118>30000,K118/2,L118/3*2),-2),IFERROR(VLOOKUP(G118,MinimumWages!$A$1:$R$60,(MATCH(Employee_Data!H118,MinimumWages!$A$1:$R$1,0)-4),0),0)),0)","v":0},0,0,0,0,0,0,0,0,0,0,0,0,0,0,0,0,0,"-"]
[118,null,null,null,null,null,null,null,null,null,null,{"$f":"IFERROR(VLOOKUP(G119,MinimumWages!$A$1:$R$60,MATCH(Employee_Data!H119,MinimumWages!$A$1:$R$1,0),0),0)","v":0},0,{"$f":"ROUND(MAX(ROUNDUP(IF(K119>30000,K119/2,L119/3*2),-2),IFERROR(VLOOKUP(G119,MinimumWages!$A$1:$R$60,(MATCH(Employee_Data!H119,MinimumWages!$A$1:$R$1,0)-4),0),0)),0)","v":0},0,0,0,0,0,0,0,0,0,0,0,0,0,0,0,0,0,"-"]
[119,null,null,null,null,null,null,null,null,null,null,{"$f":"IFERROR(VLOOKUP(G120,MinimumWages!$A$1:$R$60,MATCH(Employee_Data!H120,MinimumWages!$A$1:$R$1,0),0),0)","v":0},0,{"$f":"ROUND(MAX(ROUNDUP(IF(K120>30000,K120/2,L120/3*2),-2),IFERROR(VLOOKUP(G120,MinimumWages!$A$1:$R$60,(MATCH(Employee_Data!H120,MinimumWages!$A$1:$R$1,0)-4),0),0)),0)","v":0},0,0,0,0,0,0,0,0,0,0,0,0,0,0,0,0,0,"-"]
[120,null,null,null,null,null,null,null,null,null,null,{"$f":"IFERROR(VLOOKUP(G121,MinimumWages!$A$1:$R$60,MATCH(Employee_Data!H121,MinimumWages!$A$1:$R$1,0),0),0)","v":0},0,{"$f":"ROUND(MAX(ROUNDUP(IF(K121>30000,K121/2,L121/3*2),-2),IFERROR(VLOOKUP(G121,MinimumWages!$A$1:$R$60,(MATCH(Employee_Data!H121,MinimumWages!$A$1:$R$1,0)-4),0),0)),0)","v":0},0,0,0,0,0,0,0,0,0,0,0,0,0,0,0,0,0,"-"]
[121,null,null,null,null,null,null,null,null,null,null,{"$f":"IFERROR(VLOOKUP(G122,MinimumWages!$A$1:$R$60,MATCH(Employee_Data!H122,MinimumWages!$A$1:$R$1,0),0),0)","v":0},0,{"$f":"ROUND(MAX(ROUNDUP(IF(K122>30000,K122/2,L122/3*2),-2),IFERROR(VLOOKUP(G122,MinimumWages!$A$1:$R$60,(MATCH(Employee_Data!H122,MinimumWages!$A$1:$R$1,0)-4),0),0)),0)","v":0},0,0,0,0,0,0,0,0,0,0,0,0,0,0,0,0,0,"-"]
[122,null,null,null,null,null,null,null,null,null,null,{"$f":"IFERROR(VLOOKUP(G123,MinimumWages!$A$1:$R$60,MATCH(Employee_Data!H123,MinimumWages!$A$1:$R$1,0),0),0)","v":0},0,{"$f":"ROUND(MAX(ROUNDUP(IF(K123>30000,K123/2,L123/3*2),-2),IFERROR(VLOOKUP(G123,MinimumWages!$A$1:$R$60,(MATCH(Employee_Data!H123,MinimumWages!$A$1:$R$1,0)-4),0),0)),0)","v":0},0,0,0,0,0,0,0,0,0,0,0,0,0,0,0,0,0,"-"]
[123,null,null,null,null,null,null,null,null,null,null,{"$f":"IFERROR(VLOOKUP(G124,MinimumWages!$A$1:$R$60,MATCH(Employee_Data!H124,MinimumWages!$A$1:$R$1,0),0),0)","v":0},0,{"$f":"ROUND(MAX(ROUNDUP(IF(K124>30000,K124/2,L124/3*2),-2),IFERROR(VLOOKUP(G124,MinimumWages!$A$1:$R$60,(MATCH(Employee_Data!H124,MinimumWages!$A$1:$R$1,0)-4),0),0)),0)","v":0},0,0,0,0,0,0,0,0,0,0,0,0,0,0,0,0,0,"-"]
[124,null,null,null,null,null,null,null,null,null,null,{"$f":"IFERROR(VLOOKUP(G125,MinimumWages!$A$1:$R$60,MATCH(Employee_Data!H125,MinimumWages!$A$1:$R$1,0),0),0)","v":0},0,{"$f":"ROUND(MAX(ROUNDUP(IF(K125>30000,K125/2,L125/3*2),-2),IFERROR(VLOOKUP(G125,MinimumWages!$A$1:$R$60,(MATCH(Employee_Data!H125,MinimumWages!$A$1:$R$1,0)-4),0),0)),0)","v":0},0,0,0,0,0,0,0,0,0,0,0,0,0,0,0,0,0,"-"]
[125,null,null,null,null,null,null,null,null,null,null,{"$f":"IFERROR(VLOOKUP(G126,MinimumWages!$A$1:$R$60,MATCH(Employee_Data!H126,MinimumWages!$A$1:$R$1,0),0),0)","v":0},0,{"$f":"ROUND(MAX(ROUNDUP(IF(K126>30000,K126/2,L126/3*2),-2),IFERROR(VLOOKUP(G126,MinimumWages!$A$1:$R$60,(MATCH(Employee_Data!H126,MinimumWages!$A$1:$R$1,0)-4),0),0)),0)","v":0},0,0,0,0,0,0,0,0,0,0,0,0,0,0,0,0,0,"-"]
[126,null,null,null,null,null,null,null,null,null,null,{"$f":"IFERROR(VLOOKUP(G127,MinimumWages!$A$1:$R$60,MATCH(Employee_Data!H127,MinimumWages!$A$1:$R$1,0),0),0)","v":0},0,{"$f":"ROUND(MAX(ROUNDUP(IF(K127>30000,K127/2,L127/3*2),-2),IFERROR(VLOOKUP(G127,MinimumWages!$A$1:$R$60,(MATCH(Employee_Data!H127,MinimumWages!$A$1:$R$1,0)-4),0),0)),0)","v":0},0,0,0,0,0,0,0,0,0,0,0,0,0,0,0,0,0,"-"]
[127,null,null,null,null,null,null,null,null,null,null,{"$f":"IFERROR(VLOOKUP(G128,MinimumWages!$A$1:$R$60,MATCH(Employee_Data!H128,MinimumWages!$A$1:$R$1,0),0),0)","v":0},0,{"$f":"ROUND(MAX(ROUNDUP(IF(K128>30000,K128/2,L128/3*2),-2),IFERROR(VLOOKUP(G128,MinimumWages!$A$1:$R$60,(MATCH(Employee_Data!H128,MinimumWages!$A$1:$R$1,0)-4),0),0)),0)","v":0},0,0,0,0,0,0,0,0,0,0,0,0,0,0,0,0,0,"-"]
[128,null,null,null,null,null,null,null,null,null,null,{"$f":"IFERROR(VLOOKUP(G129,MinimumWages!$A$1:$R$60,MATCH(Employee_Data!H129,MinimumWages!$A$1:$R$1,0),0),0)","v":0},0,{"$f":"ROUND(MAX(ROUNDUP(IF(K129>30000,K129/2,L129/3*2),-2),IFERROR(VLOOKUP(G129,MinimumWages!$A$1:$R$60,(MATCH(Employee_Data!H129,MinimumWages!$A$1:$R$1,0)-4),0),0)),0)","v":0},0,0,0,0,0,0,0,0,0,0,0,0,0,0,0,0,0,"-"]
[129,null,null,null,null,null,null,null,null,null,null,{"$f":"IFERROR(VLOOKUP(G130,MinimumWages!$A$1:$R$60,MATCH(Employee_Data!H130,MinimumWages!$A$1:$R$1,0),0),0)","v":0},0,{"$f":"ROUND(MAX(ROUNDUP(IF(K130>30000,K130/2,L130/3*2),-2),IFERROR(VLOOKUP(G130,MinimumWages!$A$1:$R$60,(MATCH(Employee_Data!H130,MinimumWages!$A$1:$R$1,0)-4),0),0)),0)","v":0},0,0,0,0,0,0,0,0,0,0,0,0,0,0,0,0,0,"-"]
[{"$f":"ROW()-1","v":130},null,null,null,null,null,null,null,null,null,null,{"$f":"IFERROR(VLOOKUP(G131,MinimumWages!$A$1:$R$60,MATCH(Employee_Data!H131,MinimumWages!$A$1:$R$1,0),0),0)","v":0},0,{"$f":"ROUND(MAX(ROUNDUP(IF(K131>30000,K131/2,L131/3*2),-2),IFERROR(VLOOKUP(G131,MinimumWages!$A$1:$R$60,(MATCH(Employee_Data!H131,MinimumWages!$A$1:$R$1,0)-4),0),0)),0)","v":0},0,0,0,0,0,0,0,0,0,0,0,0,0,0,0,{"$f":"ROUND(AC131*12,0)","v":0},0,"-"]
[131,null,null,null,null,null,null,null,null,null,null,{"$f":"IFERROR(VLOOKUP(G132,MinimumWages!$A$1:$R$60,MATCH(Employee_Data!H132,MinimumWages!$A$1:$R$1,0),0),0)","v":0},0,{"$f":"ROUND(MAX(ROUNDUP(IF(K132>30000,K132/2,L132/3*2),-2),IFERROR(VLOOKUP(G132,MinimumWages!$A$1:$R$60,(MATCH(Employee_Data!H132,MinimumWages!$A$1:$R$1,0)-4),0),0)),0)","v":0},0,0,0,0,0,0,0,0,0,0,0,0,0,0,0,0,0,"-"]
[132,null,null,null,null,null,null,null,null,null,null,{"$f":"IFERROR(VLOOKUP(G133,MinimumWages!$A$1:$R$60,MATCH(Employee_Data!H133,MinimumWages!$A$1:$R$1,0),0),0)","v":0},0,{"$f":"ROUND(MAX(ROUNDUP(IF(K133>30000,K133/2,L133/3*2),-2),IFERROR(VLOOKUP(G133,MinimumWages!$A$1:$R$60,(MATCH(Employee_Data!H133,MinimumWages!$A$1:$R$1,0)-4),0),0)),0)","v":0},0,0,0,0,0,0,0,0,0,0,0,0,0,0,0,0,0,"-"]
[133,null,null,null,null,null,null,null,null,null,null,{"$f":"IFERROR(VLOOKUP(G134,MinimumWages!$A$1:$R$60,MATCH(Employee_Data!H134,MinimumWages!$A$1:$R$1,0),0),0)","v":0},0,{"$f":"ROUND(MAX(ROUNDUP(IF(K134>30000,K134/2,L134/3*2),-2),IFERROR(VLOOKUP(G134,MinimumWages!$A$1:$R$60,(MATCH(Employee_Data!H134,MinimumWages!$A$1:$R$1,0)-4),0),0)),0)","v":0},0,0,0,0,0,0,0,0,0,0,0,0,0,0,0,0,0,"-"]
[134,null,null,null,null,null,null,null,null,null,null,{"$f":"IFERROR(VLOOKUP(G135,MinimumWages!$A$1:$R$60,MATCH(Employee_Data!H135,MinimumWages!$A$1:$R$1,0),0),0)","v":0},0,{"$f":"ROUND(MAX(ROUNDUP(IF(K135>30000,K135/2,L135/3*2),-2),IFERROR(VLOOKUP(G135,MinimumWages!$A$1:$R$60,(MATCH(Employee_Data!H135,MinimumWages!$A$1:$R$1,0)-4),0),0)),0)","v":0},0,0,0,0,0,0,0,0,0,0,0,0,0,0,0,0,0,"-"]
[135,null,null,null,null,null,null,null,null,null,null,{"$f":"IFERROR(VLOOKUP(G136,MinimumWages!$A$1:$R$60,MATCH(Employee_Data!H136,MinimumWages!$A$1:$R$1,0),0),0)","v":0},0,{"$f":"ROUND(MAX(ROUNDUP(IF(K136>30000,K136/2,L136/3*2),-2),IFERROR(VLOOKUP(G136,MinimumWages!$A$1:$R$60,(MATCH(Employee_Data!H136,MinimumWages!$A$1:$R$1,0)-4),0),0)),0)","v":0},0,0,0,0,0,0,0,0,0,0,0,0,0,0,0,0,0,"-"]
[136,null,null,null,null,null,null,null,null,null,null,{"$f":"IFERROR(VLOOKUP(G137,MinimumWages!$A$1:$R$60,MATCH(Employee_Data!H137,MinimumWages!$A$1:$R$1,0),0),0)","v":0},0,{"$f":"ROUND(MAX(ROUNDUP(IF(K137>30000,K137/2,L137/3*2),-2),IFERROR(VLOOKUP(G137,MinimumWages!$A$1:$R$60,(MATCH(Employee_Data!H137,MinimumWages!$A$1:$R$1,0)-4),0),0)),0)","v":0},0,0,0,0,0,0,0,0,0,0,0,0,0,0,0,0,0,"-"]
[137,null,null,null,null,null,null,null,null,null,null,{"$f":"IFERROR(VLOOKUP(G138,MinimumWages!$A$1:$R$60,MATCH(Employee_Data!H138,MinimumWages!$A$1:$R$1,0),0),0)","v":0},0,{"$f":"ROUND(MAX(ROUNDUP(IF(K138>30000,K138/2,L138/3*2),-2),IFERROR(VLOOKUP(G138,MinimumWages!$A$1:$R$60,(MATCH(Employee_Data!H138,MinimumWages!$A$1:$R$1,0)-4),0),0)),0)","v":0},0,0,0,0,0,0,0,0,0,0,0,0,0,0,0,0,0,"-"]
[138,null,null,null,null,null,null,null,null,null,null,{"$f":"IFERROR(VLOOKUP(G139,MinimumWages!$A$1:$R$60,MATCH(Employee_Data!H139,MinimumWages!$A$1:$R$1,0),0),0)","v":0},0,{"$f":"ROUND(MAX(ROUNDUP(IF(K139>30000,K139/2,L139/3*2),-2),IFERROR(VLOOKUP(G139,MinimumWages!$A$1:$R$60,(MATCH(Employee_Data!H139,MinimumWages!$A$1:$R$1,0)-4),0),0)),0)","v":0},0,0,0,0,0,0,0,0,0,0,0,0,0,0,0,0,0,"-"]
[139,null,null,null,null,null,null,null,null,null,null,{"$f":"IFERROR(VLOOKUP(G140,MinimumWages!$A$1:$R$60,MATCH(Employee_Data!H140,MinimumWages!$A$1:$R$1,0),0),0)","v":0},0,{"$f":"ROUND(MAX(ROUNDUP(IF(K140>30000,K140/2,L140/3*2),-2),IFERROR(VLOOKUP(G140,MinimumWages!$A$1:$R$60,(MATCH(Employee_Data!H140,MinimumWages!$A$1:$R$1,0)-4),0),0)),0)","v":0},0,0,0,0,0,0,0,0,0,0,0,0,0,0,0,0,0,"-"]
[140,null,null,null,null,null,null,null,null,null,null,{"$f":"IFERROR(VLOOKUP(G141,MinimumWages!$A$1:$R$60,MATCH(Employee_Data!H141,MinimumWages!$A$1:$R$1,0),0),0)","v":0},0,{"$f":"ROUND(MAX(ROUNDUP(IF(K141>30000,K141/2,L141/3*2),-2),IFERROR(VLOOKUP(G141,MinimumWages!$A$1:$R$60,(MATCH(Employee_Data!H141,MinimumWages!$A$1:$R$1,0)-4),0),0)),0)","v":0},0,0,0,0,0,0,0,0,0,0,0,0,0,0,0,0,0,"-"]
[141,null,null,null,null,null,null,null,null,null,null,{"$f":"IFERROR(VLOOKUP(G142,MinimumWages!$A$1:$R$60,MATCH(Employee_Data!H142,MinimumWages!$A$1:$R$1,0),0),0)","v":0},0,{"$f":"ROUND(MAX(ROUNDUP(IF(K142>30000,K142/2,L142/3*2),-2),IFERROR(VLOOKUP(G142,MinimumWages!$A$1:$R$60,(MATCH(Employee_Data!H142,MinimumWages!$A$1:$R$1,0)-4),0),0)),0)","v":0},0,0,0,0,0,0,0,0,0,0,0,0,0,0,0,0,0,"-"]
[142,null,null,null,null,null,null,null,null,null,null,{"$f":"IFERROR(VLOOKUP(G143,MinimumWages!$A$1:$R$60,MATCH(Employee_Data!H143,MinimumWages!$A$1:$R$1,0),0),0)","v":0},0,{"$f":"ROUND(MAX(ROUNDUP(IF(K143>30000,K143/2,L143/3*2),-2),IFERROR(VLOOKUP(G143,MinimumWages!$A$1:$R$60,(MATCH(Employee_Data!H143,MinimumWages!$A$1:$R$1,0)-4),0),0)),0)","v":0},0,0,0,0,0,0,0,0,0,0,0,0,0,0,0,0,0,"-"]
[143,null,null,null,null,null,null,null,null,null,null,{"$f":"IFERROR(VLOOKUP(G144,MinimumWages!$A$1:$R$60,MATCH(Employee_Data!H144,MinimumWages!$A$1:$R$1,0),0),0)","v":0},0,{"$f":"ROUND(MAX(ROUNDUP(IF(K144>30000,K144/2,L144/3*2),-2),IFERROR(VLOOKUP(G144,MinimumWages!$A$1:$R$60,(MATCH(Employee_Data!H144,MinimumWages!$A$1:$R$1,0)-4),0),0)),0)","v":0},0,0,0,0,0,0,0,0,0,0,0,0,0,0,0,0,0,"-"]
[144,null,null,null,null,null,null,null,null,null,null,{"$f":"IFERROR(VLOOKUP(G145,MinimumWages!$A$1:$R$60,MATCH(Employee_Data!H145,MinimumWages!$A$1:$R$1,0),0),0)","v":0},0,{"$f":"ROUND(MAX(ROUNDUP(IF(K145>30000,K145/2,L145/3*2),-2),IFERROR(VLOOKUP(G145,MinimumWages!$A$1:$R$60,(MATCH(Employee_Data!H145,MinimumWages!$A$1:$R$1,0)-4),0),0)),0)","v":0},0,0,0,0,0,0,0,0,0,0,0,0,0,0,0,0,0,"-"]
[145,null,null,null,null,null,null,null,null,null,null,{"$f":"IFERROR(VLOOKUP(G146,MinimumWages!$A$1:$R$60,MATCH(Employee_Data!H146,MinimumWages!$A$1:$R$1,0),0),0)","v":0},0,{"$f":"ROUND(MAX(ROUNDUP(IF(K146>30000,K146/2,L146/3*2),-2),IFERROR(VLOOKUP(G146,MinimumWages!$A$1:$R$60,(MATCH(Employee_Data!H146,MinimumWages!$A$1:$R$1,0)-4),0),0)),0)","v":0},0,0,0,0,0,0,0,0,0,0,0,0,0,0,0,0,0,"-"]
[146,null,null,null,null,null,null,null,null,null,null,{"$f":"IFERROR(VLOOKUP(G147,MinimumWages!$A$1:$R$60,MATCH(Employee_Data!H147,MinimumWages!$A$1:$R$1,0),0),0)","v":0},0,{"$f":"ROUND(MAX(ROUNDUP(IF(K147>30000,K147/2,L147/3*2),-2),IFERROR(VLOOKUP(G147,MinimumWages!$A$1:$R$60,(MATCH(Employee_Data!H147,MinimumWages!$A$1:$R$1,0)-4),0),0)),0)","v":0},0,0,0,0,0,0,0,0,0,0,0,0,0,0,0,0,0,"-"]
[147,null,null,null,null,null,null,null,null,null,null,{"$f":"IFERROR(VLOOKUP(G148,MinimumWages!$A$1:$R$60,MATCH(Employee_Data!H148,MinimumWages!$A$1:$R$1,0),0),0)","v":0},0,{"$f":"ROUND(MAX(ROUNDUP(IF(K148>30000,K148/2,L148/3*2),-2),IFERROR(VLOOKUP(G148,MinimumWages!$A$1:$R$60,(MATCH(Employee_Data!H148,MinimumWages!$A$1:$R$1,0)-4),0),0)),0)","v":0},0,0,0,0,0,0,0,0,0,0,0,0,0,0,0,0,0,"-"]
[148,null,null,null,null,null,null,null,null,null,null,{"$f":"IFERROR(VLOOKUP(G149,MinimumWages!$A$1:$R$60,MATCH(Employee_Data!H149,MinimumWages!$A$1:$R$1,0),0),0)","v":0},0,{"$f":"ROUND(MAX(ROUNDUP(IF(K149>30000,K149/2,L149/3*2),-2),IFERROR(VLOOKUP(G149,MinimumWages!$A$1:$R$60,(MATCH(Employee_Data!H149,MinimumWages!$A$1:$R$1,0)-4),0),0)),0)","v":0},0,0,0,0,0,0,0,0,0,0,0,0,0,0,0,0,0,"-"]
[149,null,null,null,null,null,null,null,null,null,null,{"$f":"IFERROR(VLOOKUP(G150,MinimumWages!$A$1:$R$60,MATCH(Employee_Data!H150,MinimumWages!$A$1:$R$1,0),0),0)","v":0},0,{"$f":"ROUND(MAX(ROUNDUP(IF(K150>30000,K150/2,L150/3*2),-2),IFERROR(VLOOKUP(G150,MinimumWages!$A$1:$R$60,(MATCH(Employee_Data!H150,MinimumWages!$A$1:$R$1,0)-4),0),0)),0)","v":0},0,0,0,0,0,0,0,0,0,0,0,0,0,0,0,0,0,"-"]
[150,null,null,null,null,null,null,null,null,null,null,{"$f":"IFERROR(VLOOKUP(G151,MinimumWages!$A$1:$R$60,MATCH(Employee_Data!H151,MinimumWages!$A$1:$R$1,0),0),0)","v":0},0,{"$f":"ROUND(MAX(ROUNDUP(IF(K151>30000,K151/2,L151/3*2),-2),IFERROR(VLOOKUP(G151,MinimumWages!$A$1:$R$60,(MATCH(Employee_Data!H151,MinimumWages!$A$1:$R$1,0)-4),0),0)),0)","v":0},0,0,0,0,0,0,0,0,0,0,0,0,0,0,0,0,0,"-"]
[151,null,null,null,null,null,null,null,null,null,null,{"$f":"IFERROR(VLOOKUP(G152,MinimumWages!$A$1:$R$60,MATCH(Employee_Data!H152,MinimumWages!$A$1:$R$1,0),0),0)","v":0},0,{"$f":"ROUND(MAX(ROUNDUP(IF(K152>30000,K152/2,L152/3*2),-2),IFERROR(VLOOKUP(G152,MinimumWages!$A$1:$R$60,(MATCH(Employee_Data!H152,MinimumWages!$A$1:$R$1,0)-4),0),0)),0)","v":0},0,0,0,0,0,0,0,0,0,0,0,0,0,0,0,0,0,"-"]
[152,null,null,null,null,null,null,null,null,null,null,{"$f":"IFERROR(VLOOKUP(G153,MinimumWages!$A$1:$R$60,MATCH(Employee_Data!H153,MinimumWages!$A$1:$R$1,0),0),0)","v":0},0,{"$f":"ROUND(MAX(ROUNDUP(IF(K153>30000,K153/2,L153/3*2),-2),IFERROR(VLOOKUP(G153,MinimumWages!$A$1:$R$60,(MATCH(Employee_Data!H153,MinimumWages!$A$1:$R$1,0)-4),0),0)),0)","v":0},0,0,0,0,0,0,0,0,0,0,0,0,0,0,0,0,0,"-"]
[153,null,null,null,null,null,null,null,null,null,null,{"$f":"IFERROR(VLOOKUP(G154,MinimumWages!$A$1:$R$60,MATCH(Employee_Data!H154,MinimumWages!$A$1:$R$1,0),0),0)","v":0},0,{"$f":"ROUND(MAX(ROUNDUP(IF(K154>30000,K154/2,L154/3*2),-2),IFERROR(VLOOKUP(G154,MinimumWages!$A$1:$R$60,(MATCH(Employee_Data!H154,MinimumWages!$A$1:$R$1,0)-4),0),0)),0)","v":0},0,0,0,0,0,0,0,0,0,0,0,0,0,0,0,0,0,"-"]
[154,null,null,null,null,null,null,null,null,null,null,{"$f":"IFERROR(VLOOKUP(G155,MinimumWages!$A$1:$R$60,MATCH(Employee_Data!H155,MinimumWages!$A$1:$R$1,0),0),0)","v":0},0,{"$f":"ROUND(MAX(ROUNDUP(IF(K155>30000,K155/2,L155/3*2),-2),IFERROR(VLOOKUP(G155,MinimumWages!$A$1:$R$60,(MATCH(Employee_Data!H155,MinimumWages!$A$1:$R$1,0)-4),0),0)),0)","v":0},0,0,0,0,0,0,0,0,0,0,0,0,0,0,0,0,0,"-"]
[155,null,null,null,null,null,null,null,null,null,null,{"$f":"IFERROR(VLOOKUP(G156,MinimumWages!$A$1:$R$60,MATCH(Employee_Data!H156,MinimumWages!$A$1:$R$1,0),0),0)","v":0},0,{"$f":"ROUND(MAX(ROUNDUP(IF(K156>30000,K156/2,L156/3*2),-2),IFERROR(VLOOKUP(G156,MinimumWages!$A$1:$R$60,(MATCH(Employee_Data!H156,MinimumWages!$A$1:$R$1,0)-4),0),0)),0)","v":0},0,0,0,0,0,0,0,0,0,0,0,0,0,0,0,0,0,"-"]
[156,null,null,null,null,null,null,null,null,null,null,{"$f":"IFERROR(VLOOKUP(G157,MinimumWages!$A$1:$R$60,MATCH(Employee_Data!H157,MinimumWages!$A$1:$R$1,0),0),0)","v":0},0,{"$f":"ROUND(MAX(ROUNDUP(IF(K157>30000,K157/2,L157/3*2),-2),IFERROR(VLOOKUP(G157,MinimumWages!$A$1:$R$60,(MATCH(Employee_Data!H157,MinimumWages!$A$1:$R$1,0)-4),0),0)),0)","v":0},0,0,0,0,0,0,0,0,0,0,0,0,0,0,0,0,0,"-"]
[157,null,null,null,null,null,null,null,null,null,null,{"$f":"IFERROR(VLOOKUP(G158,MinimumWages!$A$1:$R$60,MATCH(Employee_Data!H158,MinimumWages!$A$1:$R$1,0),0),0)","v":0},0,{"$f":"ROUND(MAX(ROUNDUP(IF(K158>30000,K158/2,L158/3*2),-2),IFERROR(VLOOKUP(G158,MinimumWages!$A$1:$R$60,(MATCH(Employee_Data!H158,MinimumWages!$A$1:$R$1,0)-4),0),0)),0)","v":0},0,0,0,0,0,0,0,0,0,0,0,0,0,0,0,0,0,"-"]
[158,null,null,null,null,null,null,null,null,null,null,{"$f":"IFERROR(VLOOKUP(G159,MinimumWages!$A$1:$R$60,MATCH(Employee_Data!H159,MinimumWages!$A$1:$R$1,0),0),0)","v":0},{"$f":"ROUND(K159*12,0)","v":0},{"$f":"ROUND(MAX(ROUNDUP(IF(K159>30000,K159/2,L159/3*2),-2),IFERROR(VLOOKUP(G159,MinimumWages!$A$1:$R$60,(MATCH(Employee_Data!H159,MinimumWages!$A$1:$R$1,0)-4),0),0)),0)","v":0},{"$f":"ROUND(IF(K159<30000,N159*5%,N159/2),0)","v":0},0,0,0,0,0,0,{"$f":"SUM(N159:U159)","v":0},{"$f":"IF(I159=\"Yes\",ROUND(IF(J159=\"Limit\",MIN((V159-O159),15000),IF(N159>15000,N159,MIN((V159-O159),15000)))*12%,0),0)","v":0},{"$f":"IF(V159>21000,0,ROUNDUP(V159*3.75%,0))","v":0},{"$f":"SUM(V159:X159)","v":0},{"$f":"IF(AND(N159<=21000,K159>0),ROUND(MAX(L159,7000)*8.33%,0),0)","v":0},{"$f":"ROUND(N159/26*15/12,0)","v":0},0,{"$f":"SUM(Y159:AB159)","v":0},0,{"$f":"ROUND((M159-AD159)/12,0)","v":0},{"$f":"IF(AE159<>0,\"Un-Matched CTC\",IF(COUNTIF(N159:AE159,\"<0\")>0,\"Less CTC\",\"-\"))","v":"-"}]
[159,null,null,null,null,null,null,null,null,null,null,{"$f":"IFERROR(VLOOKUP(G160,MinimumWages!$A$1:$R$60,MATCH(Employee_Data!H160,MinimumWages!$A$1:$R$1,0),0),0)","v":0},0,{"$f":"ROUND(MAX(ROUNDUP(IF(K160>30000,K160/2,L160/3*2),-2),IFERROR(VLOOKUP(G160,MinimumWages!$A$1:$R$60,(MATCH(Employee_Data!H160,MinimumWages!$A$1:$R$1,0)-4),0),0)),0)","v":0},0,0,0,0,0,0,0,0,0,0,0,0,0,0,0,0,0,"-"]
[160,null,null,null,null,null,null,null,null,null,null,{"$f":"IFERROR(VLOOKUP(G161,MinimumWages!$A$1:$R$60,MATCH(Employee_Data!H161,MinimumWages!$A$1:$R$1,0),0),0)","v":0},0,{"$f":"ROUND(MAX(ROUNDUP(IF(K161>30000,K161/2,L161/3*2),-2),IFERROR(VLOOKUP(G161,MinimumWages!$A$1:$R$60,(MATCH(Employee_Data!H161,MinimumWages!$A$1:$R$1,0)-4),0),0)),0)","v":0},0,0,0,0,0,0,0,0,0,0,0,0,0,0,0,0,0,"-"]
[161,null,null,null,null,null,null,null,null,null,null,{"$f":"IFERROR(VLOOKUP(G162,MinimumWages!$A$1:$R$60,MATCH(Employee_Data!H162,MinimumWages!$A$1:$R$1,0),0),0)","v":0},0,{"$f":"ROUND(MAX(ROUNDUP(IF(K162>30000,K162/2,L162/3*2),-2),IFERROR(VLOOKUP(G162,MinimumWages!$A$1:$R$60,(MATCH(Employee_Data!H162,MinimumWages!$A$1:$R$1,0)-4),0),0)),0)","v":0},0,0,0,0,0,0,0,0,0,0,0,0,0,0,0,0,0,"-"]
[162,null,null,null,null,null,null,null,null,null,null,{"$f":"IFERROR(VLOOKUP(G163,MinimumWages!$A$1:$R$60,MATCH(Employee_Data!H163,MinimumWages!$A$1:$R$1,0),0),0)","v":0},0,{"$f":"ROUND(MAX(ROUNDUP(IF(K163>30000,K163/2,L163/3*2),-2),IFERROR(VLOOKUP(G163,MinimumWages!$A$1:$R$60,(MATCH(Employee_Data!H163,MinimumWages!$A$1:$R$1,0)-4),0),0)),0)","v":0},0,0,0,0,0,0,0,0,0,0,0,0,0,0,0,0,0,"-"]
[163,null,null,null,null,null,null,null,null,null,null,{"$f":"IFERROR(VLOOKUP(G164,MinimumWages!$A$1:$R$60,MATCH(Employee_Data!H164,MinimumWages!$A$1:$R$1,0),0),0)","v":0},0,{"$f":"ROUND(MAX(ROUNDUP(IF(K164>30000,K164/2,L164/3*2),-2),IFERROR(VLOOKUP(G164,MinimumWages!$A$1:$R$60,(MATCH(Employee_Data!H164,MinimumWages!$A$1:$R$1,0)-4),0),0)),0)","v":0},0,0,0,0,0,0,0,0,0,0,0,0,0,0,0,0,0,"-"]
[164,null,null,null,null,null,null,null,null,null,null,{"$f":"IFERROR(VLOOKUP(G165,MinimumWages!$A$1:$R$60,MATCH(Employee_Data!H165,MinimumWages!$A$1:$R$1,0),0),0)","v":0},0,{"$f":"ROUND(MAX(ROUNDUP(IF(K165>30000,K165/2,L165/3*2),-2),IFERROR(VLOOKUP(G165,MinimumWages!$A$1:$R$60,(MATCH(Employee_Data!H165,MinimumWages!$A$1:$R$1,0)-4),0),0)),0)","v":0},0,0,0,0,0,0,0,0,0,0,0,0,0,0,0,0,0,"-"]
[165,null,null,null,null,null,null,null,null,null,null,{"$f":"IFERROR(VLOOKUP(G166,MinimumWages!$A$1:$R$60,MATCH(Employee_Data!H166,MinimumWages!$A$1:$R$1,0),0),0)","v":0},0,{"$f":"ROUND(MAX(ROUNDUP(IF(K166>30000,K166/2,L166/3*2),-2),IFERROR(VLOOKUP(G166,MinimumWages!$A$1:$R$60,(MATCH(Employee_Data!H166,MinimumWages!$A$1:$R$1,0)-4),0),0)),0)","v":0},0,0,0,0,0,0,0,0,0,0,0,0,0,0,0,0,0,"-"]
[166,null,null,null,null,null,null,null,null,null,null,{"$f":"IFERROR(VLOOKUP(G167,MinimumWages!$A$1:$R$60,MATCH(Employee_Data!H167,MinimumWages!$A$1:$R$1,0),0),0)","v":0},0,{"$f":"ROUND(MAX(ROUNDUP(IF(K167>30000,K167/2,L167/3*2),-2),IFERROR(VLOOKUP(G167,MinimumWages!$A$1:$R$60,(MATCH(Employee_Data!H167,MinimumWages!$A$1:$R$1,0)-4),0),0)),0)","v":0},0,0,0,0,0,0,0,0,0,0,0,0,0,0,0,0,0,"-"]
[167,null,null,null,null,null,null,null,null,null,null,{"$f":"IFERROR(VLOOKUP(G168,MinimumWages!$A$1:$R$60,MATCH(Employee_Data!H168,MinimumWages!$A$1:$R$1,0),0),0)","v":0},0,{"$f":"ROUND(MAX(ROUNDUP(IF(K168>30000,K168/2,L168/3*2),-2),IFERROR(VLOOKUP(G168,MinimumWages!$A$1:$R$60,(MATCH(Employee_Data!H168,MinimumWages!$A$1:$R$1,0)-4),0),0)),0)","v":0},0,0,0,0,0,0,0,0,0,0,0,0,0,0,0,0,0,"-"]
[168,null,null,null,null,null,null,null,null,null,null,{"$f":"IFERROR(VLOOKUP(G169,MinimumWages!$A$1:$R$60,MATCH(Employee_Data!H169,MinimumWages!$A$1:$R$1,0),0),0)","v":0},0,{"$f":"ROUND(MAX(ROUNDUP(IF(K169>30000,K169/2,L169/3*2),-2),IFERROR(VLOOKUP(G169,MinimumWages!$A$1:$R$60,(MATCH(Employee_Data!H169,MinimumWages!$A$1:$R$1,0)-4),0),0)),0)","v":0},0,0,0,0,0,0,0,0,0,0,0,0,0,0,0,0,0,"-"]
[169,null,null,null,null,null,null,null,null,null,null,{"$f":"IFERROR(VLOOKUP(G170,MinimumWages!$A$1:$R$60,MATCH(Employee_Data!H170,MinimumWages!$A$1:$R$1,0),0),0)","v":0},0,{"$f":"ROUND(MAX(ROUNDUP(IF(K170>30000,K170/2,L170/3*2),-2),IFERROR(VLOOKUP(G170,MinimumWages!$A$1:$R$60,(MATCH(Employee_Data!H170,MinimumWages!$A$1:$R$1,0)-4),0),0)),0)","v":0},0,0,0,0,0,0,0,0,0,0,0,0,0,0,0,0,0,"-"]
[170,null,null,null,null,null,null,null,null,null,null,{"$f":"IFERROR(VLOOKUP(G171,MinimumWages!$A$1:$R$60,MATCH(Employee_Data!H171,MinimumWages!$A$1:$R$1,0),0),0)","v":0},0,{"$f":"ROUND(MAX(ROUNDUP(IF(K171>30000,K171/2,L171/3*2),-2),IFERROR(VLOOKUP(G171,MinimumWages!$A$1:$R$60,(MATCH(Employee_Data!H171,MinimumWages!$A$1:$R$1,0)-4),0),0)),0)","v":0},0,0,0,0,0,0,0,0,0,0,0,0,0,0,0,0,0,"-"]
[171,null,null,null,null,null,null,null,null,null,null,{"$f":"IFERROR(VLOOKUP(G172,MinimumWages!$A$1:$R$60,MATCH(Employee_Data!H172,MinimumWages!$A$1:$R$1,0),0),0)","v":0},0,{"$f":"ROUND(MAX(ROUNDUP(IF(K172>30000,K172/2,L172/3*2),-2),IFERROR(VLOOKUP(G172,MinimumWages!$A$1:$R$60,(MATCH(Employee_Data!H172,MinimumWages!$A$1:$R$1,0)-4),0),0)),0)","v":0},0,0,0,0,0,0,0,0,0,0,0,0,0,0,0,0,0,"-"]
[172,null,null,null,null,null,null,null,null,null,null,{"$f":"IFERROR(VLOOKUP(G173,MinimumWages!$A$1:$R$60,MATCH(Employee_Data!H173,MinimumWages!$A$1:$R$1,0),0),0)","v":0},0,{"$f":"ROUND(MAX(ROUNDUP(IF(K173>30000,K173/2,L173/3*2),-2),IFERROR(VLOOKUP(G173,MinimumWages!$A$1:$R$60,(MATCH(Employee_Data!H173,MinimumWages!$A$1:$R$1,0)-4),0),0)),0)","v":0},0,0,0,0,0,0,0,0,0,0,0,0,0,0,0,0,0,"-"]
[173,null,null,null,null,null,null,null,null,null,null,{"$f":"IFERROR(VLOOKUP(G174,MinimumWages!$A$1:$R$60,MATCH(Employee_Data!H174,MinimumWages!$A$1:$R$1,0),0),0)","v":0},0,{"$f":"ROUND(MAX(ROUNDUP(IF(K174>30000,K174/2,L174/3*2),-2),IFERROR(VLOOKUP(G174,MinimumWages!$A$1:$R$60,(MATCH(Employee_Data!H174,MinimumWages!$A$1:$R$1,0)-4),0),0)),0)","v":0},0,0,0,0,0,0,0,0,0,0,0,0,0,0,0,0,0,"-"]
[174,null,null,null,null,null,null,null,null,null,null,{"$f":"IFERROR(VLOOKUP(G175,MinimumWages!$A$1:$R$60,MATCH(Employee_Data!H175,MinimumWages!$A$1:$R$1,0),0),0)","v":0},0,{"$f":"ROUND(MAX(ROUNDUP(IF(K175>30000,K175/2,L175/3*2),-2),IFERROR(VLOOKUP(G175,MinimumWages!$A$1:$R$60,(MATCH(Employee_Data!H175,MinimumWages!$A$1:$R$1,0)-4),0),0)),0)","v":0},0,0,0,0,0,0,0,0,0,0,0,0,0,0,0,0,0,"-"]
[175,null,null,null,null,null,null,null,null,null,null,{"$f":"IFERROR(VLOOKUP(G176,MinimumWages!$A$1:$R$60,MATCH(Employee_Data!H176,MinimumWages!$A$1:$R$1,0),0),0)","v":0},0,{"$f":"ROUND(MAX(ROUNDUP(IF(K176>30000,K176/2,L176/3*2),-2),IFERROR(VLOOKUP(G176,MinimumWages!$A$1:$R$60,(MATCH(Employee_Data!H176,MinimumWages!$A$1:$R$1,0)-4),0),0)),0)","v":0},0,0,0,0,0,0,0,0,0,0,0,0,0,0,0,0,0,"-"]
[176,null,null,null,null,null,null,null,null,null,null,{"$f":"IFERROR(VLOOKUP(G177,MinimumWages!$A$1:$R$60,MATCH(Employee_Data!H177,MinimumWages!$A$1:$R$1,0),0),0)","v":0},0,{"$f":"ROUND(MAX(ROUNDUP(IF(K177>30000,K177/2,L177/3*2),-2),IFERROR(VLOOKUP(G177,MinimumWages!$A$1:$R$60,(MATCH(Employee_Data!H177,MinimumWages!$A$1:$R$1,0)-4),0),0)),0)","v":0},0,0,0,0,0,0,0,0,0,0,0,0,0,0,0,0,0,"-"]
[177,null,null,null,null,null,null,null,null,null,null,{"$f":"IFERROR(VLOOKUP(G178,MinimumWages!$A$1:$R$60,MATCH(Employee_Data!H178,MinimumWages!$A$1:$R$1,0),0),0)","v":0},0,{"$f":"ROUND(MAX(ROUNDUP(IF(K178>30000,K178/2,L178/3*2),-2),IFERROR(VLOOKUP(G178,MinimumWages!$A$1:$R$60,(MATCH(Employee_Data!H178,MinimumWages!$A$1:$R$1,0)-4),0),0)),0)","v":0},0,0,0,0,0,0,0,0,0,0,0,0,0,0,0,0,0,"-"]
[178,null,null,null,null,null,null,null,null,null,null,{"$f":"IFERROR(VLOOKUP(G179,MinimumWages!$A$1:$R$60,MATCH(Employee_Data!H179,MinimumWages!$A$1:$R$1,0),0),0)","v":0},0,{"$f":"ROUND(MAX(ROUNDUP(IF(K179>30000,K179/2,L179/3*2),-2),IFERROR(VLOOKUP(G179,MinimumWages!$A$1:$R$60,(MATCH(Employee_Data!H179,MinimumWages!$A$1:$R$1,0)-4),0),0)),0)","v":0},0,0,0,0,0,0,0,0,0,0,0,0,0,0,0,0,0,"-"]
[179,null,null,null,null,null,null,null,null,null,null,{"$f":"IFERROR(VLOOKUP(G180,MinimumWages!$A$1:$R$60,MATCH(Employee_Data!H180,MinimumWages!$A$1:$R$1,0),0),0)","v":0},0,{"$f":"ROUND(MAX(ROUNDUP(IF(K180>30000,K180/2,L180/3*2),-2),IFERROR(VLOOKUP(G180,MinimumWages!$A$1:$R$60,(MATCH(Employee_Data!H180,MinimumWages!$A$1:$R$1,0)-4),0),0)),0)","v":0},0,0,0,0,0,0,0,0,0,0,0,0,0,0,0,0,0,"-"]
[180,null,null,null,null,null,null,null,null,null,null,{"$f":"IFERROR(VLOOKUP(G181,MinimumWages!$A$1:$R$60,MATCH(Employee_Data!H181,MinimumWages!$A$1:$R$1,0),0),0)","v":0},0,{"$f":"ROUND(MAX(ROUNDUP(IF(K181>30000,K181/2,L181/3*2),-2),IFERROR(VLOOKUP(G181,MinimumWages!$A$1:$R$60,(MATCH(Employee_Data!H181,MinimumWages!$A$1:$R$1,0)-4),0),0)),0)","v":0},0,0,0,0,0,0,0,0,0,0,0,0,0,0,0,0,0,"-"]
[181,null,null,null,null,null,null,null,null,null,null,{"$f":"IFERROR(VLOOKUP(G182,MinimumWages!$A$1:$R$60,MATCH(Employee_Data!H182,MinimumWages!$A$1:$R$1,0),0),0)","v":0},0,{"$f":"ROUND(MAX(ROUNDUP(IF(K182>30000,K182/2,L182/3*2),-2),IFERROR(VLOOKUP(G182,MinimumWages!$A$1:$R$60,(MATCH(Employee_Data!H182,MinimumWages!$A$1:$R$1,0)-4),0),0)),0)","v":0},0,0,0,0,0,0,0,0,0,0,0,0,0,0,0,0,0,"-"]
[182,null,null,null,null,null,null,null,null,null,null,{"$f":"IFERROR(VLOOKUP(G183,MinimumWages!$A$1:$R$60,MATCH(Employee_Data!H183,MinimumWages!$A$1:$R$1,0),0),0)","v":0},0,{"$f":"ROUND(MAX(ROUNDUP(IF(K183>30000,K183/2,L183/3*2),-2),IFERROR(VLOOKUP(G183,MinimumWages!$A$1:$R$60,(MATCH(Employee_Data!H183,MinimumWages!$A$1:$R$1,0)-4),0),0)),0)","v":0},0,0,0,0,0,0,0,0,0,0,0,0,0,0,0,0,0,"-"]
[183,null,null,null,null,null,null,null,null,null,null,{"$f":"IFERROR(VLOOKUP(G184,MinimumWages!$A$1:$R$60,MATCH(Employee_Data!H184,MinimumWages!$A$1:$R$1,0),0),0)","v":0},0,{"$f":"ROUND(MAX(ROUNDUP(IF(K184>30000,K184/2,L184/3*2),-2),IFERROR(VLOOKUP(G184,MinimumWages!$A$1:$R$60,(MATCH(Employee_Data!H184,MinimumWages!$A$1:$R$1,0)-4),0),0)),0)","v":0},0,0,0,0,0,0,0,0,0,0,0,0,0,0,0,0,0,"-"]
[184,null,null,null,null,null,null,null,null,null,null,{"$f":"IFERROR(VLOOKUP(G185,MinimumWages!$A$1:$R$60,MATCH(Employee_Data!H185,MinimumWages!$A$1:$R$1,0),0),0)","v":0},0,{"$f":"ROUND(MAX(ROUNDUP(IF(K185>30000,K185/2,L185/3*2),-2),IFERROR(VLOOKUP(G185,MinimumWages!$A$1:$R$60,(MATCH(Employee_Data!H185,MinimumWages!$A$1:$R$1,0)-4),0),0)),0)","v":0},0,0,0,0,0,0,0,0,0,0,0,0,0,0,0,0,0,"-"]
[185,null,null,null,null,null,null,null,null,null,null,{"$f":"IFERROR(VLOOKUP(G186,MinimumWages!$A$1:$R$60,MATCH(Employee_Data!H186,MinimumWages!$A$1:$R$1,0),0),0)","v":0},0,{"$f":"ROUND(MAX(ROUNDUP(IF(K186>30000,K186/2,L186/3*2),-2),IFERROR(VLOOKUP(G186,MinimumWages!$A$1:$R$60,(MATCH(Employee_Data!H186,MinimumWages!$A$1:$R$1,0)-4),0),0)),0)","v":0},0,0,0,0,0,0,0,0,0,0,0,0,0,0,0,0,0,"-"]
[186,null,null,null,null,null,null,null,null,null,null,{"$f":"IFERROR(VLOOKUP(G187,MinimumWages!$A$1:$R$60,MATCH(Employee_Data!H187,MinimumWages!$A$1:$R$1,0),0),0)","v":0},0,{"$f":"ROUND(MAX(ROUNDUP(IF(K187>30000,K187/2,L187/3*2),-2),IFERROR(VLOOKUP(G187,MinimumWages!$A$1:$R$60,(MATCH(Employee_Data!H187,MinimumWages!$A$1:$R$1,0)-4),0),0)),0)","v":0},0,0,0,0,0,0,0,0,0,0,0,0,0,0,0,0,0,"-"]
[187,null,null,null,null,null,null,null,null,null,null,{"$f":"IFERROR(VLOOKUP(G188,MinimumWages!$A$1:$R$60,MATCH(Employee_Data!H188,MinimumWages!$A$1:$R$1,0),0),0)","v":0},0,{"$f":"ROUND(MAX(ROUNDUP(IF(K188>30000,K188/2,L188/3*2),-2),IFERROR(VLOOKUP(G188,MinimumWages!$A$1:$R$60,(MATCH(Employee_Data!H188,MinimumWages!$A$1:$R$1,0)-4),0),0)),0)","v":0},0,0,0,0,0,0,0,0,0,0,0,0,0,0,0,0,0,"-"]
[188,null,null,null,null,null,null,null,null,null,null,{"$f":"IFERROR(VLOOKUP(G189,MinimumWages!$A$1:$R$60,MATCH(Employee_Data!H189,MinimumWages!$A$1:$R$1,0),0),0)","v":0},0,{"$f":"ROUND(MAX(ROUNDUP(IF(K189>30000,K189/2,L189/3*2),-2),IFERROR(VLOOKUP(G189,MinimumWages!$A$1:$R$60,(MATCH(Employee_Data!H189,MinimumWages!$A$1:$R$1,0)-4),0),0)),0)","v":0},0,0,0,0,0,0,0,0,0,0,0,0,0,0,0,0,0,"-"]
[189,null,null,null,null,null,null,null,null,null,null,{"$f":"IFERROR(VLOOKUP(G190,MinimumWages!$A$1:$R$60,MATCH(Employee_Data!H190,MinimumWages!$A$1:$R$1,0),0),0)","v":0},0,{"$f":"ROUND(MAX(ROUNDUP(IF(K190>30000,K190/2,L190/3*2),-2),IFERROR(VLOOKUP(G190,MinimumWages!$A$1:$R$60,(MATCH(Employee_Data!H190,MinimumWages!$A$1:$R$1,0)-4),0),0)),0)","v":0},0,0,0,0,0,0,0,0,0,0,0,0,0,0,0,0,0,"-"]
[190,null,null,null,null,null,null,null,null,null,null,{"$f":"IFERROR(VLOOKUP(G191,MinimumWages!$A$1:$R$60,MATCH(Employee_Data!H191,MinimumWages!$A$1:$R$1,0),0),0)","v":0},0,{"$f":"ROUND(MAX(ROUNDUP(IF(K191>30000,K191/2,L191/3*2),-2),IFERROR(VLOOKUP(G191,MinimumWages!$A$1:$R$60,(MATCH(Employee_Data!H191,MinimumWages!$A$1:$R$1,0)-4),0),0)),0)","v":0},0,0,0,0,0,0,0,0,0,0,0,0,0,0,0,0,0,"-"]
[191,null,null,null,null,null,null,null,null,null,null,{"$f":"IFERROR(VLOOKUP(G192,MinimumWages!$A$1:$R$60,MATCH(Employee_Data!H192,MinimumWages!$A$1:$R$1,0),0),0)","v":0},0,{"$f":"ROUND(MAX(ROUNDUP(IF(K192>30000,K192/2,L192/3*2),-2),IFERROR(VLOOKUP(G192,MinimumWages!$A$1:$R$60,(MATCH(Employee_Data!H192,MinimumWages!$A$1:$R$1,0)-4),0),0)),0)","v":0},0,0,0,0,0,0,0,0,0,0,0,0,0,0,0,0,0,"-"]
[192,null,null,null,null,null,null,null,null,null,null,{"$f":"IFERROR(VLOOKUP(G193,MinimumWages!$A$1:$R$60,MATCH(Employee_Data!H193,MinimumWages!$A$1:$R$1,0),0),0)","v":0},0,{"$f":"ROUND(MAX(ROUNDUP(IF(K193>30000,K193/2,L193/3*2),-2),IFERROR(VLOOKUP(G193,MinimumWages!$A$1:$R$60,(MATCH(Employee_Data!H193,MinimumWages!$A$1:$R$1,0)-4),0),0)),0)","v":0},0,0,0,0,0,0,0,0,0,0,0,0,0,0,0,0,0,"-"]
[193,null,null,null,null,null,null,null,null,null,null,{"$f":"IFERROR(VLOOKUP(G194,MinimumWages!$A$1:$R$60,MATCH(Employee_Data!H194,MinimumWages!$A$1:$R$1,0),0),0)","v":0},0,{"$f":"ROUND(MAX(ROUNDUP(IF(K194>30000,K194/2,L194/3*2),-2),IFERROR(VLOOKUP(G194,MinimumWages!$A$1:$R$60,(MATCH(Employee_Data!H194,MinimumWages!$A$1:$R$1,0)-4),0),0)),0)","v":0},0,0,0,0,0,0,0,0,0,0,0,0,0,0,0,0,0,"-"]
[{"$f":"ROW()-1","v":194},null,null,null,null,null,null,null,null,null,null,{"$f":"IFERROR(VLOOKUP(G195,MinimumWages!$A$1:$R$60,MATCH(Employee_Data!H195,MinimumWages!$A$1:$R$1,0),0),0)","v":0},0,{"$f":"ROUND(MAX(ROUNDUP(IF(K195>30000,K195/2,L195/3*2),-2),IFERROR(VLOOKUP(G195,MinimumWages!$A$1:$R$60,(MATCH(Employee_Data!H195,MinimumWages!$A$1:$R$1,0)-4),0),0)),0)","v":0},0,0,0,0,0,0,0,0,0,0,0,0,0,0,0,{"$f":"ROUND(AC195*12,0)","v":0},0,"-"]
[195,null,null,null,null,null,null,null,null,null,null,{"$f":"IFERROR(VLOOKUP(G196,MinimumWages!$A$1:$R$60,MATCH(Employee_Data!H196,MinimumWages!$A$1:$R$1,0),0),0)","v":0},0,{"$f":"ROUND(MAX(ROUNDUP(IF(K196>30000,K196/2,L196/3*2),-2),IFERROR(VLOOKUP(G196,MinimumWages!$A$1:$R$60,(MATCH(Employee_Data!H196,MinimumWages!$A$1:$R$1,0)-4),0),0)),0)","v":0},0,0,0,0,0,0,0,0,0,0,0,0,0,0,0,0,0,"-"]
[196,null,null,null,null,null,null,null,null,null,null,{"$f":"IFERROR(VLOOKUP(G197,MinimumWages!$A$1:$R$60,MATCH(Employee_Data!H197,MinimumWages!$A$1:$R$1,0),0),0)","v":0},0,{"$f":"ROUND(MAX(ROUNDUP(IF(K197>30000,K197/2,L197/3*2),-2),IFERROR(VLOOKUP(G197,MinimumWages!$A$1:$R$60,(MATCH(Employee_Data!H197,MinimumWages!$A$1:$R$1,0)-4),0),0)),0)","v":0},0,0,0,0,0,0,0,0,0,0,0,0,0,0,0,0,0,"-"]
[197,null,null,null,null,null,null,null,null,null,null,{"$f":"IFERROR(VLOOKUP(G198,MinimumWages!$A$1:$R$60,MATCH(Employee_Data!H198,MinimumWages!$A$1:$R$1,0),0),0)","v":0},0,{"$f":"ROUND(MAX(ROUNDUP(IF(K198>30000,K198/2,L198/3*2),-2),IFERROR(VLOOKUP(G198,MinimumWages!$A$1:$R$60,(MATCH(Employee_Data!H198,MinimumWages!$A$1:$R$1,0)-4),0),0)),0)","v":0},0,0,0,0,0,0,0,0,0,0,0,0,0,0,0,0,0,"-"]
[198,null,null,null,null,null,null,null,null,null,null,{"$f":"IFERROR(VLOOKUP(G199,MinimumWages!$A$1:$R$60,MATCH(Employee_Data!H199,MinimumWages!$A$1:$R$1,0),0),0)","v":0},0,{"$f":"ROUND(MAX(ROUNDUP(IF(K199>30000,K199/2,L199/3*2),-2),IFERROR(VLOOKUP(G199,MinimumWages!$A$1:$R$60,(MATCH(Employee_Data!H199,MinimumWages!$A$1:$R$1,0)-4),0),0)),0)","v":0},0,0,0,0,0,0,0,0,0,0,0,0,0,0,0,0,0,"-"]
[199,null,null,null,null,null,null,null,null,null,null,{"$f":"IFERROR(VLOOKUP(G200,MinimumWages!$A$1:$R$60,MATCH(Employee_Data!H200,MinimumWages!$A$1:$R$1,0),0),0)","v":0},0,{"$f":"ROUND(MAX(ROUNDUP(IF(K200>30000,K200/2,L200/3*2),-2),IFERROR(VLOOKUP(G200,MinimumWages!$A$1:$R$60,(MATCH(Employee_Data!H200,MinimumWages!$A$1:$R$1,0)-4),0),0)),0)","v":0},0,0,0,0,0,0,0,0,0,0,0,0,0,0,0,0,0,"-"]
[200,null,null,null,null,null,null,null,null,null,null,{"$f":"IFERROR(VLOOKUP(G201,MinimumWages!$A$1:$R$60,MATCH(Employee_Data!H201,MinimumWages!$A$1:$R$1,0),0),0)","v":0},0,{"$f":"ROUND(MAX(ROUNDUP(IF(K201>30000,K201/2,L201/3*2),-2),IFERROR(VLOOKUP(G201,MinimumWages!$A$1:$R$60,(MATCH(Employee_Data!H201,MinimumWages!$A$1:$R$1,0)-4),0),0)),0)","v":0},0,0,0,0,0,0,0,0,0,0,0,0,0,0,0,0,0,"-"]
[201,null,null,null,null,null,null,null,null,null,null,{"$f":"IFERROR(VLOOKUP(G202,MinimumWages!$A$1:$R$60,MATCH(Employee_Data!H202,MinimumWages!$A$1:$R$1,0),0),0)","v":0},0,{"$f":"ROUND(MAX(ROUNDUP(IF(K202>30000,K202/2,L202/3*2),-2),IFERROR(VLOOKUP(G202,MinimumWages!$A$1:$R$60,(MATCH(Employee_Data!H202,MinimumWages!$A$1:$R$1,0)-4),0),0)),0)","v":0},0,0,0,0,0,0,0,0,0,0,0,0,0,0,0,0,0,"-"]
[202,null,null,null,null,null,null,null,null,null,null,{"$f":"IFERROR(VLOOKUP(G203,MinimumWages!$A$1:$R$60,MATCH(Employee_Data!H203,MinimumWages!$A$1:$R$1,0),0),0)","v":0},0,{"$f":"ROUND(MAX(ROUNDUP(IF(K203>30000,K203/2,L203/3*2),-2),IFERROR(VLOOKUP(G203,MinimumWages!$A$1:$R$60,(MATCH(Employee_Data!H203,MinimumWages!$A$1:$R$1,0)-4),0),0)),0)","v":0},0,0,0,0,0,0,0,0,0,0,0,0,0,0,0,0,0,"-"]
[203,null,null,null,null,null,null,null,null,null,null,{"$f":"IFERROR(VLOOKUP(G204,MinimumWages!$A$1:$R$60,MATCH(Employee_Data!H204,MinimumWages!$A$1:$R$1,0),0),0)","v":0},0,{"$f":"ROUND(MAX(ROUNDUP(IF(K204>30000,K204/2,L204/3*2),-2),IFERROR(VLOOKUP(G204,MinimumWages!$A$1:$R$60,(MATCH(Employee_Data!H204,MinimumWages!$A$1:$R$1,0)-4),0),0)),0)","v":0},0,0,0,0,0,0,0,0,0,0,0,0,0,0,0,0,0,"-"]
[204,null,null,null,null,null,null,null,null,null,null,{"$f":"IFERROR(VLOOKUP(G205,MinimumWages!$A$1:$R$60,MATCH(Employee_Data!H205,MinimumWages!$A$1:$R$1,0),0),0)","v":0},0,{"$f":"ROUND(MAX(ROUNDUP(IF(K205>30000,K205/2,L205/3*2),-2),IFERROR(VLOOKUP(G205,MinimumWages!$A$1:$R$60,(MATCH(Employee_Data!H205,MinimumWages!$A$1:$R$1,0)-4),0),0)),0)","v":0},0,0,0,0,0,0,0,0,0,0,0,0,0,0,0,0,0,"-"]
[205,null,null,null,null,null,null,null,null,null,null,{"$f":"IFERROR(VLOOKUP(G206,MinimumWages!$A$1:$R$60,MATCH(Employee_Data!H206,MinimumWages!$A$1:$R$1,0),0),0)","v":0},0,{"$f":"ROUND(MAX(ROUNDUP(IF(K206>30000,K206/2,L206/3*2),-2),IFERROR(VLOOKUP(G206,MinimumWages!$A$1:$R$60,(MATCH(Employee_Data!H206,MinimumWages!$A$1:$R$1,0)-4),0),0)),0)","v":0},0,0,0,0,0,0,0,0,0,0,0,0,0,0,0,0,0,"-"]
[206,null,null,null,null,null,null,null,null,null,null,{"$f":"IFERROR(VLOOKUP(G207,MinimumWages!$A$1:$R$60,MATCH(Employee_Data!H207,MinimumWages!$A$1:$R$1,0),0),0)","v":0},0,{"$f":"ROUND(MAX(ROUNDUP(IF(K207>30000,K207/2,L207/3*2),-2),IFERROR(VLOOKUP(G207,MinimumWages!$A$1:$R$60,(MATCH(Employee_Data!H207,MinimumWages!$A$1:$R$1,0)-4),0),0)),0)","v":0},0,0,0,0,0,0,0,0,0,0,0,0,0,0,0,0,0,"-"]
[207,null,null,null,null,null,null,null,null,null,null,{"$f":"IFERROR(VLOOKUP(G208,MinimumWages!$A$1:$R$60,MATCH(Employee_Data!H208,MinimumWages!$A$1:$R$1,0),0),0)","v":0},0,{"$f":"ROUND(MAX(ROUNDUP(IF(K208>30000,K208/2,L208/3*2),-2),IFERROR(VLOOKUP(G208,MinimumWages!$A$1:$R$60,(MATCH(Employee_Data!H208,MinimumWages!$A$1:$R$1,0)-4),0),0)),0)","v":0},0,0,0,0,0,0,0,0,0,0,0,0,0,0,0,0,0,"-"]
[208,null,null,null,null,null,null,null,null,null,null,{"$f":"IFERROR(VLOOKUP(G209,MinimumWages!$A$1:$R$60,MATCH(Employee_Data!H209,MinimumWages!$A$1:$R$1,0),0),0)","v":0},0,{"$f":"ROUND(MAX(ROUNDUP(IF(K209>30000,K209/2,L209/3*2),-2),IFERROR(VLOOKUP(G209,MinimumWages!$A$1:$R$60,(MATCH(Employee_Data!H209,MinimumWages!$A$1:$R$1,0)-4),0),0)),0)","v":0},0,0,0,0,0,0,0,0,0,0,0,0,0,0,0,0,0,"-"]
[209,null,null,null,null,null,null,null,null,null,null,{"$f":"IFERROR(VLOOKUP(G210,MinimumWages!$A$1:$R$60,MATCH(Employee_Data!H210,MinimumWages!$A$1:$R$1,0),0),0)","v":0},0,{"$f":"ROUND(MAX(ROUNDUP(IF(K210>30000,K210/2,L210/3*2),-2),IFERROR(VLOOKUP(G210,MinimumWages!$A$1:$R$60,(MATCH(Employee_Data!H210,MinimumWages!$A$1:$R$1,0)-4),0),0)),0)","v":0},0,0,0,0,0,0,0,0,0,0,0,0,0,0,0,0,0,"-"]
[210,null,null,null,null,null,null,null,null,null,null,{"$f":"IFERROR(VLOOKUP(G211,MinimumWages!$A$1:$R$60,MATCH(Employee_Data!H211,MinimumWages!$A$1:$R$1,0),0),0)","v":0},0,{"$f":"ROUND(MAX(ROUNDUP(IF(K211>30000,K211/2,L211/3*2),-2),IFERROR(VLOOKUP(G211,MinimumWages!$A$1:$R$60,(MATCH(Employee_Data!H211,MinimumWages!$A$1:$R$1,0)-4),0),0)),0)","v":0},0,0,0,0,0,0,0,0,0,0,0,0,0,0,0,0,0,"-"]
[211,null,null,null,null,null,null,null,null,null,null,{"$f":"IFERROR(VLOOKUP(G212,MinimumWages!$A$1:$R$60,MATCH(Employee_Data!H212,MinimumWages!$A$1:$R$1,0),0),0)","v":0},0,{"$f":"ROUND(MAX(ROUNDUP(IF(K212>30000,K212/2,L212/3*2),-2),IFERROR(VLOOKUP(G212,MinimumWages!$A$1:$R$60,(MATCH(Employee_Data!H212,MinimumWages!$A$1:$R$1,0)-4),0),0)),0)","v":0},0,0,0,0,0,0,0,0,0,0,0,0,0,0,0,0,0,"-"]
[212,null,null,null,null,null,null,null,null,null,null,{"$f":"IFERROR(VLOOKUP(G213,MinimumWages!$A$1:$R$60,MATCH(Employee_Data!H213,MinimumWages!$A$1:$R$1,0),0),0)","v":0},0,{"$f":"ROUND(MAX(ROUNDUP(IF(K213>30000,K213/2,L213/3*2),-2),IFERROR(VLOOKUP(G213,MinimumWages!$A$1:$R$60,(MATCH(Employee_Data!H213,MinimumWages!$A$1:$R$1,0)-4),0),0)),0)","v":0},0,0,0,0,0,0,0,0,0,0,0,0,0,0,0,0,0,"-"]
[213,null,null,null,null,null,null,null,null,null,null,{"$f":"IFERROR(VLOOKUP(G214,MinimumWages!$A$1:$R$60,MATCH(Employee_Data!H214,MinimumWages!$A$1:$R$1,0),0),0)","v":0},0,{"$f":"ROUND(MAX(ROUNDUP(IF(K214>30000,K214/2,L214/3*2),-2),IFERROR(VLOOKUP(G214,MinimumWages!$A$1:$R$60,(MATCH(Employee_Data!H214,MinimumWages!$A$1:$R$1,0)-4),0),0)),0)","v":0},0,0,0,0,0,0,0,0,0,0,0,0,0,0,0,0,0,"-"]
[214,null,null,null,null,null,null,null,null,null,null,{"$f":"IFERROR(VLOOKUP(G215,MinimumWages!$A$1:$R$60,MATCH(Employee_Data!H215,MinimumWages!$A$1:$R$1,0),0),0)","v":0},0,{"$f":"ROUND(MAX(ROUNDUP(IF(K215>30000,K215/2,L215/3*2),-2),IFERROR(VLOOKUP(G215,MinimumWages!$A$1:$R$60,(MATCH(Employee_Data!H215,MinimumWages!$A$1:$R$1,0)-4),0),0)),0)","v":0},0,0,0,0,0,0,0,0,0,0,0,0,0,0,0,0,0,"-"]
[215,null,null,null,null,null,null,null,null,null,null,{"$f":"IFERROR(VLOOKUP(G216,MinimumWages!$A$1:$R$60,MATCH(Employee_Data!H216,MinimumWages!$A$1:$R$1,0),0),0)","v":0},0,{"$f":"ROUND(MAX(ROUNDUP(IF(K216>30000,K216/2,L216/3*2),-2),IFERROR(VLOOKUP(G216,MinimumWages!$A$1:$R$60,(MATCH(Employee_Data!H216,MinimumWages!$A$1:$R$1,0)-4),0),0)),0)","v":0},0,0,0,0,0,0,0,0,0,0,0,0,0,0,0,0,0,"-"]
[216,null,null,null,null,null,null,null,null,null,null,{"$f":"IFERROR(VLOOKUP(G217,MinimumWages!$A$1:$R$60,MATCH(Employee_Data!H217,MinimumWages!$A$1:$R$1,0),0),0)","v":0},0,{"$f":"ROUND(MAX(ROUNDUP(IF(K217>30000,K217/2,L217/3*2),-2),IFERROR(VLOOKUP(G217,MinimumWages!$A$1:$R$60,(MATCH(Employee_Data!H217,MinimumWages!$A$1:$R$1,0)-4),0),0)),0)","v":0},0,0,0,0,0,0,0,0,0,0,0,0,0,0,0,0,0,"-"]
[217,null,null,null,null,null,null,null,null,null,null,{"$f":"IFERROR(VLOOKUP(G218,MinimumWages!$A$1:$R$60,MATCH(Employee_Data!H218,MinimumWages!$A$1:$R$1,0),0),0)","v":0},0,{"$f":"ROUND(MAX(ROUNDUP(IF(K218>30000,K218/2,L218/3*2),-2),IFERROR(VLOOKUP(G218,MinimumWages!$A$1:$R$60,(MATCH(Employee_Data!H218,MinimumWages!$A$1:$R$1,0)-4),0),0)),0)","v":0},0,0,0,0,0,0,0,0,0,0,0,0,0,0,0,0,0,"-"]
[218,null,null,null,null,null,null,null,null,null,null,{"$f":"IFERROR(VLOOKUP(G219,MinimumWages!$A$1:$R$60,MATCH(Employee_Data!H219,MinimumWages!$A$1:$R$1,0),0),0)","v":0},0,{"$f":"ROUND(MAX(ROUNDUP(IF(K219>30000,K219/2,L219/3*2),-2),IFERROR(VLOOKUP(G219,MinimumWages!$A$1:$R$60,(MATCH(Employee_Data!H219,MinimumWages!$A$1:$R$1,0)-4),0),0)),0)","v":0},0,0,0,0,0,0,0,0,0,0,0,0,0,0,0,0,0,"-"]
[219,null,null,null,null,null,null,null,null,null,null,{"$f":"IFERROR(VLOOKUP(G220,MinimumWages!$A$1:$R$60,MATCH(Employee_Data!H220,MinimumWages!$A$1:$R$1,0),0),0)","v":0},0,{"$f":"ROUND(MAX(ROUNDUP(IF(K220>30000,K220/2,L220/3*2),-2),IFERROR(VLOOKUP(G220,MinimumWages!$A$1:$R$60,(MATCH(Employee_Data!H220,MinimumWages!$A$1:$R$1,0)-4),0),0)),0)","v":0},0,0,0,0,0,0,0,0,0,0,0,0,0,0,0,0,0,"-"]
[220,null,null,null,null,null,null,null,null,null,null,{"$f":"IFERROR(VLOOKUP(G221,MinimumWages!$A$1:$R$60,MATCH(Employee_Data!H221,MinimumWages!$A$1:$R$1,0),0),0)","v":0},0,{"$f":"ROUND(MAX(ROUNDUP(IF(K221>30000,K221/2,L221/3*2),-2),IFERROR(VLOOKUP(G221,MinimumWages!$A$1:$R$60,(MATCH(Employee_Data!H221,MinimumWages!$A$1:$R$1,0)-4),0),0)),0)","v":0},0,0,0,0,0,0,0,0,0,0,0,0,0,0,0,0,0,"-"]
[221,null,null,null,null,null,null,null,null,null,null,{"$f":"IFERROR(VLOOKUP(G222,MinimumWages!$A$1:$R$60,MATCH(Employee_Data!H222,MinimumWages!$A$1:$R$1,0),0),0)","v":0},0,{"$f":"ROUND(MAX(ROUNDUP(IF(K222>30000,K222/2,L222/3*2),-2),IFERROR(VLOOKUP(G222,MinimumWages!$A$1:$R$60,(MATCH(Employee_Data!H222,MinimumWages!$A$1:$R$1,0)-4),0),0)),0)","v":0},0,0,0,0,0,0,0,0,0,0,0,0,0,0,0,0,0,"-"]
[222,null,null,null,null,null,null,null,null,null,null,{"$f":"IFERROR(VLOOKUP(G223,MinimumWages!$A$1:$R$60,MATCH(Employee_Data!H223,MinimumWages!$A$1:$R$1,0),0),0)","v":0},{"$f":"ROUND(K223*12,0)","v":0},{"$f":"ROUND(MAX(ROUNDUP(IF(K223>30000,K223/2,L223/3*2),-2),IFERROR(VLOOKUP(G223,MinimumWages!$A$1:$R$60,(MATCH(Employee_Data!H223,MinimumWages!$A$1:$R$1,0)-4),0),0)),0)","v":0},{"$f":"ROUND(IF(K223<30000,N223*5%,N223/2),0)","v":0},0,0,0,0,0,0,{"$f":"SUM(N223:U223)","v":0},{"$f":"IF(I223=\"Yes\",ROUND(IF(J223=\"Limit\",MIN((V223-O223),15000),IF(N223>15000,N223,MIN((V223-O223),15000)))*12%,0),0)","v":0},{"$f":"IF(V223>21000,0,ROUNDUP(V223*3.75%,0))","v":0},{"$f":"SUM(V223:X223)","v":0},{"$f":"IF(AND(N223<=21000,K223>0),ROUND(MAX(L223,7000)*8.33%,0),0)","v":0},{"$f":"ROUND(N223/26*15/12,0)","v":0},0,{"$f":"SUM(Y223:AB223)","v":0},0,{"$f":"ROUND((M223-AD223)/12,0)","v":0},{"$f":"IF(AE223<>0,\"Un-Matched CTC\",IF(COUNTIF(N223:AE223,\"<0\")>0,\"Less CTC\",\"-\"))","v":"-"}]
[223,null,null,null,null,null,null,null,null,null,null,{"$f":"IFERROR(VLOOKUP(G224,MinimumWages!$A$1:$R$60,MATCH(Employee_Data!H224,MinimumWages!$A$1:$R$1,0),0),0)","v":0},0,{"$f":"ROUND(MAX(ROUNDUP(IF(K224>30000,K224/2,L224/3*2),-2),IFERROR(VLOOKUP(G224,MinimumWages!$A$1:$R$60,(MATCH(Employee_Data!H224,MinimumWages!$A$1:$R$1,0)-4),0),0)),0)","v":0},0,0,0,0,0,0,0,0,0,0,0,0,0,0,0,0,0,"-"]
[224,null,null,null,null,null,null,null,null,null,null,{"$f":"IFERROR(VLOOKUP(G225,MinimumWages!$A$1:$R$60,MATCH(Employee_Data!H225,MinimumWages!$A$1:$R$1,0),0),0)","v":0},0,{"$f":"ROUND(MAX(ROUNDUP(IF(K225>30000,K225/2,L225/3*2),-2),IFERROR(VLOOKUP(G225,MinimumWages!$A$1:$R$60,(MATCH(Employee_Data!H225,MinimumWages!$A$1:$R$1,0)-4),0),0)),0)","v":0},0,0,0,0,0,0,0,0,0,0,0,0,0,0,0,0,0,"-"]
[225,null,null,null,null,null,null,null,null,null,null,{"$f":"IFERROR(VLOOKUP(G226,MinimumWages!$A$1:$R$60,MATCH(Employee_Data!H226,MinimumWages!$A$1:$R$1,0),0),0)","v":0},0,{"$f":"ROUND(MAX(ROUNDUP(IF(K226>30000,K226/2,L226/3*2),-2),IFERROR(VLOOKUP(G226,MinimumWages!$A$1:$R$60,(MATCH(Employee_Data!H226,MinimumWages!$A$1:$R$1,0)-4),0),0)),0)","v":0},0,0,0,0,0,0,0,0,0,0,0,0,0,0,0,0,0,"-"]
[226,null,null,null,null,null,null,null,null,null,null,{"$f":"IFERROR(VLOOKUP(G227,MinimumWages!$A$1:$R$60,MATCH(Employee_Data!H227,MinimumWages!$A$1:$R$1,0),0),0)","v":0},0,{"$f":"ROUND(MAX(ROUNDUP(IF(K227>30000,K227/2,L227/3*2),-2),IFERROR(VLOOKUP(G227,MinimumWages!$A$1:$R$60,(MATCH(Employee_Data!H227,MinimumWages!$A$1:$R$1,0)-4),0),0)),0)","v":0},0,0,0,0,0,0,0,0,0,0,0,0,0,0,0,0,0,"-"]
[227,null,null,null,null,null,null,null,null,null,null,{"$f":"IFERROR(VLOOKUP(G228,MinimumWages!$A$1:$R$60,MATCH(Employee_Data!H228,MinimumWages!$A$1:$R$1,0),0),0)","v":0},0,{"$f":"ROUND(MAX(ROUNDUP(IF(K228>30000,K228/2,L228/3*2),-2),IFERROR(VLOOKUP(G228,MinimumWages!$A$1:$R$60,(MATCH(Employee_Data!H228,MinimumWages!$A$1:$R$1,0)-4),0),0)),0)","v":0},0,0,0,0,0,0,0,0,0,0,0,0,0,0,0,0,0,"-"]
[228,null,null,null,null,null,null,null,null,null,null,{"$f":"IFERROR(VLOOKUP(G229,MinimumWages!$A$1:$R$60,MATCH(Employee_Data!H229,MinimumWages!$A$1:$R$1,0),0),0)","v":0},0,{"$f":"ROUND(MAX(ROUNDUP(IF(K229>30000,K229/2,L229/3*2),-2),IFERROR(VLOOKUP(G229,MinimumWages!$A$1:$R$60,(MATCH(Employee_Data!H229,MinimumWages!$A$1:$R$1,0)-4),0),0)),0)","v":0},0,0,0,0,0,0,0,0,0,0,0,0,0,0,0,0,0,"-"]
[229,null,null,null,null,null,null,null,null,null,null,{"$f":"IFERROR(VLOOKUP(G230,MinimumWages!$A$1:$R$60,MATCH(Employee_Data!H230,MinimumWages!$A$1:$R$1,0),0),0)","v":0},0,{"$f":"ROUND(MAX(ROUNDUP(IF(K230>30000,K230/2,L230/3*2),-2),IFERROR(VLOOKUP(G230,MinimumWages!$A$1:$R$60,(MATCH(Employee_Data!H230,MinimumWages!$A$1:$R$1,0)-4),0),0)),0)","v":0},0,0,0,0,0,0,0,0,0,0,0,0,0,0,0,0,0,"-"]
[230,null,null,null,null,null,null,null,null,null,null,{"$f":"IFERROR(VLOOKUP(G231,MinimumWages!$A$1:$R$60,MATCH(Employee_Data!H231,MinimumWages!$A$1:$R$1,0),0),0)","v":0},0,{"$f":"ROUND(MAX(ROUNDUP(IF(K231>30000,K231/2,L231/3*2),-2),IFERROR(VLOOKUP(G231,MinimumWages!$A$1:$R$60,(MATCH(Employee_Data!H231,MinimumWages!$A$1:$R$1,0)-4),0),0)),0)","v":0},0,0,0,0,0,0,0,0,0,0,0,0,0,0,0,0,0,"-"]
[231,null,null,null,null,null,null,null,null,null,null,{"$f":"IFERROR(VLOOKUP(G232,MinimumWages!$A$1:$R$60,MATCH(Employee_Data!H232,MinimumWages!$A$1:$R$1,0),0),0)","v":0},0,{"$f":"ROUND(MAX(ROUNDUP(IF(K232>30000,K232/2,L232/3*2),-2),IFERROR(VLOOKUP(G232,MinimumWages!$A$1:$R$60,(MATCH(Employee_Data!H232,MinimumWages!$A$1:$R$1,0)-4),0),0)),0)","v":0},0,0,0,0,0,0,0,0,0,0,0,0,0,0,0,0,0,"-"]
[232,null,null,null,null,null,null,null,null,null,null,{"$f":"IFERROR(VLOOKUP(G233,MinimumWages!$A$1:$R$60,MATCH(Employee_Data!H233,MinimumWages!$A$1:$R$1,0),0),0)","v":0},0,{"$f":"ROUND(MAX(ROUNDUP(IF(K233>30000,K233/2,L233/3*2),-2),IFERROR(VLOOKUP(G233,MinimumWages!$A$1:$R$60,(MATCH(Employee_Data!H233,MinimumWages!$A$1:$R$1,0)-4),0),0)),0)","v":0},0,0,0,0,0,0,0,0,0,0,0,0,0,0,0,0,0,"-"]
[233,null,null,null,null,null,null,null,null,null,null,{"$f":"IFERROR(VLOOKUP(G234,MinimumWages!$A$1:$R$60,MATCH(Employee_Data!H234,MinimumWages!$A$1:$R$1,0),0),0)","v":0},0,{"$f":"ROUND(MAX(ROUNDUP(IF(K234>30000,K234/2,L234/3*2),-2),IFERROR(VLOOKUP(G234,MinimumWages!$A$1:$R$60,(MATCH(Employee_Data!H234,MinimumWages!$A$1:$R$1,0)-4),0),0)),0)","v":0},0,0,0,0,0,0,0,0,0,0,0,0,0,0,0,0,0,"-"]
[234,null,null,null,null,null,null,null,null,null,null,{"$f":"IFERROR(VLOOKUP(G235,MinimumWages!$A$1:$R$60,MATCH(Employee_Data!H235,MinimumWages!$A$1:$R$1,0),0),0)","v":0},0,{"$f":"ROUND(MAX(ROUNDUP(IF(K235>30000,K235/2,L235/3*2),-2),IFERROR(VLOOKUP(G235,MinimumWages!$A$1:$R$60,(MATCH(Employee_Data!H235,MinimumWages!$A$1:$R$1,0)-4),0),0)),0)","v":0},0,0,0,0,0,0,0,0,0,0,0,0,0,0,0,0,0,"-"]
[235,null,null,null,null,null,null,null,null,null,null,{"$f":"IFERROR(VLOOKUP(G236,MinimumWages!$A$1:$R$60,MATCH(Employee_Data!H236,MinimumWages!$A$1:$R$1,0),0),0)","v":0},0,{"$f":"ROUND(MAX(ROUNDUP(IF(K236>30000,K236/2,L236/3*2),-2),IFERROR(VLOOKUP(G236,MinimumWages!$A$1:$R$60,(MATCH(Employee_Data!H236,MinimumWages!$A$1:$R$1,0)-4),0),0)),0)","v":0},0,0,0,0,0,0,0,0,0,0,0,0,0,0,0,0,0,"-"]
[236,null,null,null,null,null,null,null,null,null,null,{"$f":"IFERROR(VLOOKUP(G237,MinimumWages!$A$1:$R$60,MATCH(Employee_Data!H237,MinimumWages!$A$1:$R$1,0),0),0)","v":0},0,{"$f":"ROUND(MAX(ROUNDUP(IF(K237>30000,K237/2,L237/3*2),-2),IFERROR(VLOOKUP(G237,MinimumWages!$A$1:$R$60,(MATCH(Employee_Data!H237,MinimumWages!$A$1:$R$1,0)-4),0),0)),0)","v":0},0,0,0,0,0,0,0,0,0,0,0,0,0,0,0,0,0,"-"]
[237,null,null,null,null,null,null,null,null,null,null,{"$f":"IFERROR(VLOOKUP(G238,MinimumWages!$A$1:$R$60,MATCH(Employee_Data!H238,MinimumWages!$A$1:$R$1,0),0),0)","v":0},0,{"$f":"ROUND(MAX(ROUNDUP(IF(K238>30000,K238/2,L238/3*2),-2),IFERROR(VLOOKUP(G238,MinimumWages!$A$1:$R$60,(MATCH(Employee_Data!H238,MinimumWages!$A$1:$R$1,0)-4),0),0)),0)","v":0},0,0,0,0,0,0,0,0,0,0,0,0,0,0,0,0,0,"-"]
[238,null,null,null,null,null,null,null,null,null,null,{"$f":"IFERROR(VLOOKUP(G239,MinimumWages!$A$1:$R$60,MATCH(Employee_Data!H239,MinimumWages!$A$1:$R$1,0),0),0)","v":0},0,{"$f":"ROUND(MAX(ROUNDUP(IF(K239>30000,K239/2,L239/3*2),-2),IFERROR(VLOOKUP(G239,MinimumWages!$A$1:$R$60,(MATCH(Employee_Data!H239,MinimumWages!$A$1:$R$1,0)-4),0),0)),0)","v":0},0,0,0,0,0,0,0,0,0,0,0,0,0,0,0,0,0,"-"]
[239,null,null,null,null,null,null,null,null,null,null,{"$f":"IFERROR(VLOOKUP(G240,MinimumWages!$A$1:$R$60,MATCH(Employee_Data!H240,MinimumWages!$A$1:$R$1,0),0),0)","v":0},0,{"$f":"ROUND(MAX(ROUNDUP(IF(K240>30000,K240/2,L240/3*2),-2),IFERROR(VLOOKUP(G240,MinimumWages!$A$1:$R$60,(MATCH(Employee_Data!H240,MinimumWages!$A$1:$R$1,0)-4),0),0)),0)","v":0},0,0,0,0,0,0,0,0,0,0,0,0,0,0,0,0,0,"-"]
[240,null,null,null,null,null,null,null,null,null,null,{"$f":"IFERROR(VLOOKUP(G241,MinimumWages!$A$1:$R$60,MATCH(Employee_Data!H241,MinimumWages!$A$1:$R$1,0),0),0)","v":0},0,{"$f":"ROUND(MAX(ROUNDUP(IF(K241>30000,K241/2,L241/3*2),-2),IFERROR(VLOOKUP(G241,MinimumWages!$A$1:$R$60,(MATCH(Employee_Data!H241,MinimumWages!$A$1:$R$1,0)-4),0),0)),0)","v":0},0,0,0,0,0,0,0,0,0,0,0,0,0,0,0,0,0,"-"]
[241,null,null,null,null,null,null,null,null,null,null,{"$f":"IFERROR(VLOOKUP(G242,MinimumWages!$A$1:$R$60,MATCH(Employee_Data!H242,MinimumWages!$A$1:$R$1,0),0),0)","v":0},0,{"$f":"ROUND(MAX(ROUNDUP(IF(K242>30000,K242/2,L242/3*2),-2),IFERROR(VLOOKUP(G242,MinimumWages!$A$1:$R$60,(MATCH(Employee_Data!H242,MinimumWages!$A$1:$R$1,0)-4),0),0)),0)","v":0},0,0,0,0,0,0,0,0,0,0,0,0,0,0,0,0,0,"-"]
[242,null,null,null,null,null,null,null,null,null,null,{"$f":"IFERROR(VLOOKUP(G243,MinimumWages!$A$1:$R$60,MATCH(Employee_Data!H243,MinimumWages!$A$1:$R$1,0),0),0)","v":0},0,{"$f":"ROUND(MAX(ROUNDUP(IF(K243>30000,K243/2,L243/3*2),-2),IFERROR(VLOOKUP(G243,MinimumWages!$A$1:$R$60,(MATCH(Employee_Data!H243,MinimumWages!$A$1:$R$1,0)-4),0),0)),0)","v":0},0,0,0,0,0,0,0,0,0,0,0,0,0,0,0,0,0,"-"]
[243,null,null,null,null,null,null,null,null,null,null,{"$f":"IFERROR(VLOOKUP(G244,MinimumWages!$A$1:$R$60,MATCH(Employee_Data!H244,MinimumWages!$A$1:$R$1,0),0),0)","v":0},0,{"$f":"ROUND(MAX(ROUNDUP(IF(K244>30000,K244/2,L244/3*2),-2),IFERROR(VLOOKUP(G244,MinimumWages!$A$1:$R$60,(MATCH(Employee_Data!H244,MinimumWages!$A$1:$R$1,0)-4),0),0)),0)","v":0},0,0,0,0,0,0,0,0,0,0,0,0,0,0,0,0,0,"-"]
[244,null,null,null,null,null,null,null,null,null,null,{"$f":"IFERROR(VLOOKUP(G245,MinimumWages!$A$1:$R$60,MATCH(Employee_Data!H245,MinimumWages!$A$1:$R$1,0),0),0)","v":0},0,{"$f":"ROUND(MAX(ROUNDUP(IF(K245>30000,K245/2,L245/3*2),-2),IFERROR(VLOOKUP(G245,MinimumWages!$A$1:$R$60,(MATCH(Employee_Data!H245,MinimumWages!$A$1:$R$1,0)-4),0),0)),0)","v":0},0,0,0,0,0,0,0,0,0,0,0,0,0,0,0,0,0,"-"]
[245,null,null,null,null,null,null,null,null,null,null,{"$f":"IFERROR(VLOOKUP(G246,MinimumWages!$A$1:$R$60,MATCH(Employee_Data!H246,MinimumWages!$A$1:$R$1,0),0),0)","v":0},0,{"$f":"ROUND(MAX(ROUNDUP(IF(K246>30000,K246/2,L246/3*2),-2),IFERROR(VLOOKUP(G246,MinimumWages!$A$1:$R$60,(MATCH(Employee_Data!H246,MinimumWages!$A$1:$R$1,0)-4),0),0)),0)","v":0},0,0,0,0,0,0,0,0,0,0,0,0,0,0,0,0,0,"-"]
[246,null,null,null,null,null,null,null,null,null,null,{"$f":"IFERROR(VLOOKUP(G247,MinimumWages!$A$1:$R$60,MATCH(Employee_Data!H247,MinimumWages!$A$1:$R$1,0),0),0)","v":0},0,{"$f":"ROUND(MAX(ROUNDUP(IF(K247>30000,K247/2,L247/3*2),-2),IFERROR(VLOOKUP(G247,MinimumWages!$A$1:$R$60,(MATCH(Employee_Data!H247,MinimumWages!$A$1:$R$1,0)-4),0),0)),0)","v":0},0,0,0,0,0,0,0,0,0,0,0,0,0,0,0,0,0,"-"]
[247,null,null,null,null,null,null,null,null,null,null,{"$f":"IFERROR(VLOOKUP(G248,MinimumWages!$A$1:$R$60,MATCH(Employee_Data!H248,MinimumWages!$A$1:$R$1,0),0),0)","v":0},0,{"$f":"ROUND(MAX(ROUNDUP(IF(K248>30000,K248/2,L248/3*2),-2),IFERROR(VLOOKUP(G248,MinimumWages!$A$1:$R$60,(MATCH(Employee_Data!H248,MinimumWages!$A$1:$R$1,0)-4),0),0)),0)","v":0},0,0,0,0,0,0,0,0,0,0,0,0,0,0,0,0,0,"-"]
[248,null,null,null,null,null,null,null,null,null,null,{"$f":"IFERROR(VLOOKUP(G249,MinimumWages!$A$1:$R$60,MATCH(Employee_Data!H249,MinimumWages!$A$1:$R$1,0),0),0)","v":0},0,{"$f":"ROUND(MAX(ROUNDUP(IF(K249>30000,K249/2,L249/3*2),-2),IFERROR(VLOOKUP(G249,MinimumWages!$A$1:$R$60,(MATCH(Employee_Data!H249,MinimumWages!$A$1:$R$1,0)-4),0),0)),0)","v":0},0,0,0,0,0,0,0,0,0,0,0,0,0,0,0,0,0,"-"]
[249,null,null,null,null,null,null,null,null,null,null,{"$f":"IFERROR(VLOOKUP(G250,MinimumWages!$A$1:$R$60,MATCH(Employee_Data!H250,MinimumWages!$A$1:$R$1,0),0),0)","v":0},0,{"$f":"ROUND(MAX(ROUNDUP(IF(K250>30000,K250/2,L250/3*2),-2),IFERROR(VLOOKUP(G250,MinimumWages!$A$1:$R$60,(MATCH(Employee_Data!H250,MinimumWages!$A$1:$R$1,0)-4),0),0)),0)","v":0},0,0,0,0,0,0,0,0,0,0,0,0,0,0,0,0,0,"-"]
[250,null,null,null,null,null,null,null,null,null,null,{"$f":"IFERROR(VLOOKUP(G251,MinimumWages!$A$1:$R$60,MATCH(Employee_Data!H251,MinimumWages!$A$1:$R$1,0),0),0)","v":0},0,{"$f":"ROUND(MAX(ROUNDUP(IF(K251>30000,K251/2,L251/3*2),-2),IFERROR(VLOOKUP(G251,MinimumWages!$A$1:$R$60,(MATCH(Employee_Data!H251,MinimumWages!$A$1:$R$1,0)-4),0),0)),0)","v":0},0,0,0,0,0,0,0,0,0,0,0,0,0,0,0,0,0,"-"]
[251,null,null,null,null,null,null,null,null,null,null,{"$f":"IFERROR(VLOOKUP(G252,MinimumWages!$A$1:$R$60,MATCH(Employee_Data!H252,MinimumWages!$A$1:$R$1,0),0),0)","v":0},0,{"$f":"ROUND(MAX(ROUNDUP(IF(K252>30000,K252/2,L252/3*2),-2),IFERROR(VLOOKUP(G252,MinimumWages!$A$1:$R$60,(MATCH(Employee_Data!H252,MinimumWages!$A$1:$R$1,0)-4),0),0)),0)","v":0},0,0,0,0,0,0,0,0,0,0,0,0,0,0,0,0,0,"-"]
[252,null,null,null,null,null,null,null,null,null,null,{"$f":"IFERROR(VLOOKUP(G253,MinimumWages!$A$1:$R$60,MATCH(Employee_Data!H253,MinimumWages!$A$1:$R$1,0),0),0)","v":0},0,{"$f":"ROUND(MAX(ROUNDUP(IF(K253>30000,K253/2,L253/3*2),-2),IFERROR(VLOOKUP(G253,MinimumWages!$A$1:$R$60,(MATCH(Employee_Data!H253,MinimumWages!$A$1:$R$1,0)-4),0),0)),0)","v":0},0,0,0,0,0,0,0,0,0,0,0,0,0,0,0,0,0,"-"]
[253,null,null,null,null,null,null,null,null,null,null,{"$f":"IFERROR(VLOOKUP(G254,MinimumWages!$A$1:$R$60,MATCH(Employee_Data!H254,MinimumWages!$A$1:$R$1,0),0),0)","v":0},0,{"$f":"ROUND(MAX(ROUNDUP(IF(K254>30000,K254/2,L254/3*2),-2),IFERROR(VLOOKUP(G254,MinimumWages!$A$1:$R$60,(MATCH(Employee_Data!H254,MinimumWages!$A$1:$R$1,0)-4),0),0)),0)","v":0},0,0,0,0,0,0,0,0,0,0,0,0,0,0,0,0,0,"-"]
[254,null,null,null,null,null,null,null,null,null,null,{"$f":"IFERROR(VLOOKUP(G255,MinimumWages!$A$1:$R$60,MATCH(Employee_Data!H255,MinimumWages!$A$1:$R$1,0),0),0)","v":0},0,{"$f":"ROUND(MAX(ROUNDUP(IF(K255>30000,K255/2,L255/3*2),-2),IFERROR(VLOOKUP(G255,MinimumWages!$A$1:$R$60,(MATCH(Employee_Data!H255,MinimumWages!$A$1:$R$1,0)-4),0),0)),0)","v":0},0,0,0,0,0,0,0,0,0,0,0,0,0,0,0,0,0,"-"]
[255,null,null,null,null,null,null,null,null,null,null,{"$f":"IFERROR(VLOOKUP(G256,MinimumWages!$A$1:$R$60,MATCH(Employee_Data!H256,MinimumWages!$A$1:$R$1,0),0),0)","v":0},0,{"$f":"ROUND(MAX(ROUNDUP(IF(K256>30000,K256/2,L256/3*2),-2),IFERROR(VLOOKUP(G256,MinimumWages!$A$1:$R$60,(MATCH(Employee_Data!H256,MinimumWages!$A$1:$R$1,0)-4),0),0)),0)","v":0},0,0,0,0,0,0,0,0,0,0,0,0,0,0,0,0,0,"-"]
[256,null,null,null,null,null,null,null,null,null,null,{"$f":"IFERROR(VLOOKUP(G257,MinimumWages!$A$1:$R$60,MATCH(Employee_Data!H257,MinimumWages!$A$1:$R$1,0),0),0)","v":0},0,{"$f":"ROUND(MAX(ROUNDUP(IF(K257>30000,K257/2,L257/3*2),-2),IFERROR(VLOOKUP(G257,MinimumWages!$A$1:$R$60,(MATCH(Employee_Data!H257,MinimumWages!$A$1:$R$1,0)-4),0),0)),0)","v":0},0,0,0,0,0,0,0,0,0,0,0,0,0,0,0,0,0,"-"]
[257,null,null,null,null,null,null,null,null,null,null,{"$f":"IFERROR(VLOOKUP(G258,MinimumWages!$A$1:$R$60,MATCH(Employee_Data!H258,MinimumWages!$A$1:$R$1,0),0),0)","v":0},0,{"$f":"ROUND(MAX(ROUNDUP(IF(K258>30000,K258/2,L258/3*2),-2),IFERROR(VLOOKUP(G258,MinimumWages!$A$1:$R$60,(MATCH(Employee_Data!H258,MinimumWages!$A$1:$R$1,0)-4),0),0)),0)","v":0},0,0,0,0,0,0,0,0,0,0,0,0,0,0,0,0,0,"-"]
[{"$f":"ROW()-1","v":258},null,null,null,null,null,null,null,null,null,null,{"$f":"IFERROR(VLOOKUP(G259,MinimumWages!$A$1:$R$60,MATCH(Employee_Data!H259,MinimumWages!$A$1:$R$1,0),0),0)","v":0},0,{"$f":"ROUND(MAX(ROUNDUP(IF(K259>30000,K259/2,L259/3*2),-2),IFERROR(VLOOKUP(G259,MinimumWages!$A$1:$R$60,(MATCH(Employee_Data!H259,MinimumWages!$A$1:$R$1,0)-4),0),0)),0)","v":0},0,0,0,0,0,0,0,0,0,0,0,0,0,0,0,{"$f":"ROUND(AC259*12,0)","v":0},0,"-"]
[259,null,null,null,null,null,null,null,null,null,null,{"$f":"IFERROR(VLOOKUP(G260,MinimumWages!$A$1:$R$60,MATCH(Employee_Data!H260,MinimumWages!$A$1:$R$1,0),0),0)","v":0},0,{"$f":"ROUND(MAX(ROUNDUP(IF(K260>30000,K260/2,L260/3*2),-2),IFERROR(VLOOKUP(G260,MinimumWages!$A$1:$R$60,(MATCH(Employee_Data!H260,MinimumWages!$A$1:$R$1,0)-4),0),0)),0)","v":0},0,0,0,0,0,0,0,0,0,0,0,0,0,0,0,0,0,"-"]
[260,null,null,null,null,null,null,null,null,null,null,{"$f":"IFERROR(VLOOKUP(G261,MinimumWages!$A$1:$R$60,MATCH(Employee_Data!H261,MinimumWages!$A$1:$R$1,0),0),0)","v":0},0,{"$f":"ROUND(MAX(ROUNDUP(IF(K261>30000,K261/2,L261/3*2),-2),IFERROR(VLOOKUP(G261,MinimumWages!$A$1:$R$60,(MATCH(Employee_Data!H261,MinimumWages!$A$1:$R$1,0)-4),0),0)),0)","v":0},0,0,0,0,0,0,0,0,0,0,0,0,0,0,0,0,0,"-"]
[261,null,null,null,null,null,null,null,null,null,null,{"$f":"IFERROR(VLOOKUP(G262,MinimumWages!$A$1:$R$60,MATCH(Employee_Data!H262,MinimumWages!$A$1:$R$1,0),0),0)","v":0},0,{"$f":"ROUND(MAX(ROUNDUP(IF(K262>30000,K262/2,L262/3*2),-2),IFERROR(VLOOKUP(G262,MinimumWages!$A$1:$R$60,(MATCH(Employee_Data!H262,MinimumWages!$A$1:$R$1,0)-4),0),0)),0)","v":0},0,0,0,0,0,0,0,0,0,0,0,0,0,0,0,0,0,"-"]
[262,null,null,null,null,null,null,null,null,null,null,{"$f":"IFERROR(VLOOKUP(G263,MinimumWages!$A$1:$R$60,MATCH(Employee_Data!H263,MinimumWages!$A$1:$R$1,0),0),0)","v":0},0,{"$f":"ROUND(MAX(ROUNDUP(IF(K263>30000,K263/2,L263/3*2),-2),IFERROR(VLOOKUP(G263,MinimumWages!$A$1:$R$60,(MATCH(Employee_Data!H263,MinimumWages!$A$1:$R$1,0)-4),0),0)),0)","v":0},0,0,0,0,0,0,0,0,0,0,0,0,0,0,0,0,0,"-"]
[263,null,null,null,null,null,null,null,null,null,null,{"$f":"IFERROR(VLOOKUP(G264,MinimumWages!$A$1:$R$60,MATCH(Employee_Data!H264,MinimumWages!$A$1:$R$1,0),0),0)","v":0},0,{"$f":"ROUND(MAX(ROUNDUP(IF(K264>30000,K264/2,L264/3*2),-2),IFERROR(VLOOKUP(G264,MinimumWages!$A$1:$R$60,(MATCH(Employee_Data!H264,MinimumWages!$A$1:$R$1,0)-4),0),0)),0)","v":0},0,0,0,0,0,0,0,0,0,0,0,0,0,0,0,0,0,"-"]
[264,null,null,null,null,null,null,null,null,null,null,{"$f":"IFERROR(VLOOKUP(G265,MinimumWages!$A$1:$R$60,MATCH(Employee_Data!H265,MinimumWages!$A$1:$R$1,0),0),0)","v":0},0,{"$f":"ROUND(MAX(ROUNDUP(IF(K265>30000,K265/2,L265/3*2),-2),IFERROR(VLOOKUP(G265,MinimumWages!$A$1:$R$60,(MATCH(Employee_Data!H265,MinimumWages!$A$1:$R$1,0)-4),0),0)),0)","v":0},0,0,0,0,0,0,0,0,0,0,0,0,0,0,0,0,0,"-"]
[265,null,null,null,null,null,null,null,null,null,null,{"$f":"IFERROR(VLOOKUP(G266,MinimumWages!$A$1:$R$60,MATCH(Employee_Data!H266,MinimumWages!$A$1:$R$1,0),0),0)","v":0},0,{"$f":"ROUND(MAX(ROUNDUP(IF(K266>30000,K266/2,L266/3*2),-2),IFERROR(VLOOKUP(G266,MinimumWages!$A$1:$R$60,(MATCH(Employee_Data!H266,MinimumWages!$A$1:$R$1,0)-4),0),0)),0)","v":0},0,0,0,0,0,0,0,0,0,0,0,0,0,0,0,0,0,"-"]
[266,null,null,null,null,null,null,null,null,null,null,{"$f":"IFERROR(VLOOKUP(G267,MinimumWages!$A$1:$R$60,MATCH(Employee_Data!H267,MinimumWages!$A$1:$R$1,0),0),0)","v":0},0,{"$f":"ROUND(MAX(ROUNDUP(IF(K267>30000,K267/2,L267/3*2),-2),IFERROR(VLOOKUP(G267,MinimumWages!$A$1:$R$60,(MATCH(Employee_Data!H267,MinimumWages!$A$1:$R$1,0)-4),0),0)),0)","v":0},0,0,0,0,0,0,0,0,0,0,0,0,0,0,0,0,0,"-"]
[267,null,null,null,null,null,null,null,null,null,null,{"$f":"IFERROR(VLOOKUP(G268,MinimumWages!$A$1:$R$60,MATCH(Employee_Data!H268,MinimumWages!$A$1:$R$1,0),0),0)","v":0},0,{"$f":"ROUND(MAX(ROUNDUP(IF(K268>30000,K268/2,L268/3*2),-2),IFERROR(VLOOKUP(G268,MinimumWages!$A$1:$R$60,(MATCH(Employee_Data!H268,MinimumWages!$A$1:$R$1,0)-4),0),0)),0)","v":0},0,0,0,0,0,0,0,0,0,0,0,0,0,0,0,0,0,"-"]
[268,null,null,null,null,null,null,null,null,null,null,{"$f":"IFERROR(VLOOKUP(G269,MinimumWages!$A$1:$R$60,MATCH(Employee_Data!H269,MinimumWages!$A$1:$R$1,0),0),0)","v":0},0,{"$f":"ROUND(MAX(ROUNDUP(IF(K269>30000,K269/2,L269/3*2),-2),IFERROR(VLOOKUP(G269,MinimumWages!$A$1:$R$60,(MATCH(Employee_Data!H269,MinimumWages!$A$1:$R$1,0)-4),0),0)),0)","v":0},0,0,0,0,0,0,0,0,0,0,0,0,0,0,0,0,0,"-"]
[269,null,null,null,null,null,null,null,null,null,null,{"$f":"IFERROR(VLOOKUP(G270,MinimumWages!$A$1:$R$60,MATCH(Employee_Data!H270,MinimumWages!$A$1:$R$1,0),0),0)","v":0},0,{"$f":"ROUND(MAX(ROUNDUP(IF(K270>30000,K270/2,L270/3*2),-2),IFERROR(VLOOKUP(G270,MinimumWages!$A$1:$R$60,(MATCH(Employee_Data!H270,MinimumWages!$A$1:$R$1,0)-4),0),0)),0)","v":0},0,0,0,0,0,0,0,0,0,0,0,0,0,0,0,0,0,"-"]
[270,null,null,null,null,null,null,null,null,null,null,{"$f":"IFERROR(VLOOKUP(G271,MinimumWages!$A$1:$R$60,MATCH(Employee_Data!H271,MinimumWages!$A$1:$R$1,0),0),0)","v":0},0,{"$f":"ROUND(MAX(ROUNDUP(IF(K271>30000,K271/2,L271/3*2),-2),IFERROR(VLOOKUP(G271,MinimumWages!$A$1:$R$60,(MATCH(Employee_Data!H271,MinimumWages!$A$1:$R$1,0)-4),0),0)),0)","v":0},0,0,0,0,0,0,0,0,0,0,0,0,0,0,0,0,0,"-"]
[271,null,null,null,null,null,null,null,null,null,null,{"$f":"IFERROR(VLOOKUP(G272,MinimumWages!$A$1:$R$60,MATCH(Employee_Data!H272,MinimumWages!$A$1:$R$1,0),0),0)","v":0},0,{"$f":"ROUND(MAX(ROUNDUP(IF(K272>30000,K272/2,L272/3*2),-2),IFERROR(VLOOKUP(G272,MinimumWages!$A$1:$R$60,(MATCH(Employee_Data!H272,MinimumWages!$A$1:$R$1,0)-4),0),0)),0)","v":0},0,0,0,0,0,0,0,0,0,0,0,0,0,0,0,0,0,"-"]
[272,null,null,null,null,null,null,null,null,null,null,{"$f":"IFERROR(VLOOKUP(G273,MinimumWages!$A$1:$R$60,MATCH(Employee_Data!H273,MinimumWages!$A$1:$R$1,0),0),0)","v":0},0,{"$f":"ROUND(MAX(ROUNDUP(IF(K273>30000,K273/2,L273/3*2),-2),IFERROR(VLOOKUP(G273,MinimumWages!$A$1:$R$60,(MATCH(Employee_Data!H273,MinimumWages!$A$1:$R$1,0)-4),0),0)),0)","v":0},0,0,0,0,0,0,0,0,0,0,0,0,0,0,0,0,0,"-"]
[273,null,null,null,null,null,null,null,null,null,null,{"$f":"IFERROR(VLOOKUP(G274,MinimumWages!$A$1:$R$60,MATCH(Employee_Data!H274,MinimumWages!$A$1:$R$1,0),0),0)","v":0},0,{"$f":"ROUND(MAX(ROUNDUP(IF(K274>30000,K274/2,L274/3*2),-2),IFERROR(VLOOKUP(G274,MinimumWages!$A$1:$R$60,(MATCH(Employee_Data!H274,MinimumWages!$A$1:$R$1,0)-4),0),0)),0)","v":0},0,0,0,0,0,0,0,0,0,0,0,0,0,0,0,0,0,"-"]
[274,null,null,null,null,null,null,null,null,null,null,{"$f":"IFERROR(VLOOKUP(G275,MinimumWages!$A$1:$R$60,MATCH(Employee_Data!H275,MinimumWages!$A$1:$R$1,0),0),0)","v":0},0,{"$f":"ROUND(MAX(ROUNDUP(IF(K275>30000,K275/2,L275/3*2),-2),IFERROR(VLOOKUP(G275,MinimumWages!$A$1:$R$60,(MATCH(Employee_Data!H275,MinimumWages!$A$1:$R$1,0)-4),0),0)),0)","v":0},0,0,0,0,0,0,0,0,0,0,0,0,0,0,0,0,0,"-"]
[275,null,null,null,null,null,null,null,null,null,null,{"$f":"IFERROR(VLOOKUP(G276,MinimumWages!$A$1:$R$60,MATCH(Employee_Data!H276,MinimumWages!$A$1:$R$1,0),0),0)","v":0},0,{"$f":"ROUND(MAX(ROUNDUP(IF(K276>30000,K276/2,L276/3*2),-2),IFERROR(VLOOKUP(G276,MinimumWages!$A$1:$R$60,(MATCH(Employee_Data!H276,MinimumWages!$A$1:$R$1,0)-4),0),0)),0)","v":0},0,0,0,0,0,0,0,0,0,0,0,0,0,0,0,0,0,"-"]
[276,null,null,null,null,null,null,null,null,null,null,{"$f":"IFERROR(VLOOKUP(G277,MinimumWages!$A$1:$R$60,MATCH(Employee_Data!H277,MinimumWages!$A$1:$R$1,0),0),0)","v":0},0,{"$f":"ROUND(MAX(ROUNDUP(IF(K277>30000,K277/2,L277/3*2),-2),IFERROR(VLOOKUP(G277,MinimumWages!$A$1:$R$60,(MATCH(Employee_Data!H277,MinimumWages!$A$1:$R$1,0)-4),0),0)),0)","v":0},0,0,0,0,0,0,0,0,0,0,0,0,0,0,0,0,0,"-"]
[277,null,null,null,null,null,null,null,null,null,null,{"$f":"IFERROR(VLOOKUP(G278,MinimumWages!$A$1:$R$60,MATCH(Employee_Data!H278,MinimumWages!$A$1:$R$1,0),0),0)","v":0},0,{"$f":"ROUND(MAX(ROUNDUP(IF(K278>30000,K278/2,L278/3*2),-2),IFERROR(VLOOKUP(G278,MinimumWages!$A$1:$R$60,(MATCH(Employee_Data!H278,MinimumWages!$A$1:$R$1,0)-4),0),0)),0)","v":0},0,0,0,0,0,0,0,0,0,0,0,0,0,0,0,0,0,"-"]
[278,null,null,null,null,null,null,null,null,null,null,{"$f":"IFERROR(VLOOKUP(G279,MinimumWages!$A$1:$R$60,MATCH(Employee_Data!H279,MinimumWages!$A$1:$R$1,0),0),0)","v":0},0,{"$f":"ROUND(MAX(ROUNDUP(IF(K279>30000,K279/2,L279/3*2),-2),IFERROR(VLOOKUP(G279,MinimumWages!$A$1:$R$60,(MATCH(Employee_Data!H279,MinimumWages!$A$1:$R$1,0)-4),0),0)),0)","v":0},0,0,0,0,0,0,0,0,0,0,0,0,0,0,0,0,0,"-"]
[279,null,null,null,null,null,null,null,null,null,null,{"$f":"IFERROR(VLOOKUP(G280,MinimumWages!$A$1:$R$60,MATCH(Employee_Data!H280,MinimumWages!$A$1:$R$1,0),0),0)","v":0},0,{"$f":"ROUND(MAX(ROUNDUP(IF(K280>30000,K280/2,L280/3*2),-2),IFERROR(VLOOKUP(G280,MinimumWages!$A$1:$R$60,(MATCH(Employee_Data!H280,MinimumWages!$A$1:$R$1,0)-4),0),0)),0)","v":0},0,0,0,0,0,0,0,0,0,0,0,0,0,0,0,0,0,"-"]
[280,null,null,null,null,null,null,null,null,null,null,{"$f":"IFERROR(VLOOKUP(G281,MinimumWages!$A$1:$R$60,MATCH(Employee_Data!H281,MinimumWages!$A$1:$R$1,0),0),0)","v":0},0,{"$f":"ROUND(MAX(ROUNDUP(IF(K281>30000,K281/2,L281/3*2),-2),IFERROR(VLOOKUP(G281,MinimumWages!$A$1:$R$60,(MATCH(Employee_Data!H281,MinimumWages!$A$1:$R$1,0)-4),0),0)),0)","v":0},0,0,0,0,0,0,0,0,0,0,0,0,0,0,0,0,0,"-"]
[281,null,null,null,null,null,null,null,null,null,null,{"$f":"IFERROR(VLOOKUP(G282,MinimumWages!$A$1:$R$60,MATCH(Employee_Data!H282,MinimumWages!$A$1:$R$1,0),0),0)","v":0},0,{"$f":"ROUND(MAX(ROUNDUP(IF(K282>30000,K282/2,L282/3*2),-2),IFERROR(VLOOKUP(G282,MinimumWages!$A$1:$R$60,(MATCH(Employee_Data!H282,MinimumWages!$A$1:$R$1,0)-4),0),0)),0)","v":0},0,0,0,0,0,0,0,0,0,0,0,0,0,0,0,0,0,"-"]
[282,null,null,null,null,null,null,null,null,null,null,{"$f":"IFERROR(VLOOKUP(G283,MinimumWages!$A$1:$R$60,MATCH(Employee_Data!H283,MinimumWages!$A$1:$R$1,0),0),0)","v":0},0,{"$f":"ROUND(MAX(ROUNDUP(IF(K283>30000,K283/2,L283/3*2),-2),IFERROR(VLOOKUP(G283,MinimumWages!$A$1:$R$60,(MATCH(Employee_Data!H283,MinimumWages!$A$1:$R$1,0)-4),0),0)),0)","v":0},0,0,0,0,0,0,0,0,0,0,0,0,0,0,0,0,0,"-"]
[283,null,null,null,null,null,null,null,null,null,null,{"$f":"IFERROR(VLOOKUP(G284,MinimumWages!$A$1:$R$60,MATCH(Employee_Data!H284,MinimumWages!$A$1:$R$1,0),0),0)","v":0},0,{"$f":"ROUND(MAX(ROUNDUP(IF(K284>30000,K284/2,L284/3*2),-2),IFERROR(VLOOKUP(G284,MinimumWages!$A$1:$R$60,(MATCH(Employee_Data!H284,MinimumWages!$A$1:$R$1,0)-4),0),0)),0)","v":0},0,0,0,0,0,0,0,0,0,0,0,0,0,0,0,0,0,"-"]
[284,null,null,null,null,null,null,null,null,null,null,{"$f":"IFERROR(VLOOKUP(G285,MinimumWages!$A$1:$R$60,MATCH(Employee_Data!H285,MinimumWages!$A$1:$R$1,0),0),0)","v":0},0,{"$f":"ROUND(MAX(ROUNDUP(IF(K285>30000,K285/2,L285/3*2),-2),IFERROR(VLOOKUP(G285,MinimumWages!$A$1:$R$60,(MATCH(Employee_Data!H285,MinimumWages!$A$1:$R$1,0)-4),0),0)),0)","v":0},0,0,0,0,0,0,0,0,0,0,0,0,0,0,0,0,0,"-"]
[285,null,null,null,null,null,null,null,null,null,null,{"$f":"IFERROR(VLOOKUP(G286,MinimumWages!$A$1:$R$60,MATCH(Employee_Data!H286,MinimumWages!$A$1:$R$1,0),0),0)","v":0},0,{"$f":"ROUND(MAX(ROUNDUP(IF(K286>30000,K286/2,L286/3*2),-2),IFERROR(VLOOKUP(G286,MinimumWages!$A$1:$R$60,(MATCH(Employee_Data!H286,MinimumWages!$A$1:$R$1,0)-4),0),0)),0)","v":0},0,0,0,0,0,0,0,0,0,0,0,0,0,0,0,0,0,"-"]
[286,null,null,null,null,null,null,null,null,null,null,{"$f":"IFERROR(VLOOKUP(G287,MinimumWages!$A$1:$R$60,MATCH(Employee_Data!H287,MinimumWages!$A$1:$R$1,0),0),0)","v":0},{"$f":"ROUND(K287*12,0)","v":0},{"$f":"ROUND(MAX(ROUNDUP(IF(K287>30000,K287/2,L287/3*2),-2),IFERROR(VLOOKUP(G287,MinimumWages!$A$1:$R$60,(MATCH(Employee_Data!H287,MinimumWages!$A$1:$R$1,0)-4),0),0)),0)","v":0},{"$f":"ROUND(IF(K287<30000,N287*5%,N287/2),0)","v":0},0,0,0,0,0,0,{"$f":"SUM(N287:U287)","v":0},{"$f":"IF(I287=\"Yes\",ROUND(IF(J287=\"Limit\",MIN((V287-O287),15000),IF(N287>15000,N287,MIN((V287-O287),15000)))*12%,0),0)","v":0},{"$f":"IF(V287>21000,0,ROUNDUP(V287*3.75%,0))","v":0},{"$f":"SUM(V287:X287)","v":0},{"$f":"IF(AND(N287<=21000,K287>0),ROUND(MAX(L287,7000)*8.33%,0),0)","v":0},{"$f":"ROUND(N287/26*15/12,0)","v":0},0,{"$f":"SUM(Y287:AB287)","v":0},0,{"$f":"ROUND((M287-AD287)/12,0)","v":0},{"$f":"IF(AE287<>0,\"Un-Matched CTC\",IF(COUNTIF(N287:AE287,\"<0\")>0,\"Less CTC\",\"-\"))","v":"-"}]
[287,null,null,null,null,null,null,null,null,null,null,{"$f":"IFERROR(VLOOKUP(G288,MinimumWages!$A$1:$R$60,MATCH(Employee_Data!H288,MinimumWages!$A$1:$R$1,0),0),0)","v":0},0,{"$f":"ROUND(MAX(ROUNDUP(IF(K288>30000,K288/2,L288/3*2),-2),IFERROR(VLOOKUP(G288,MinimumWages!$A$1:$R$60,(MATCH(Employee_Data!H288,MinimumWages!$A$1:$R$1,0)-4),0),0)),0)","v":0},0,0,0,0,0,0,0,0,0,0,0,0,0,0,0,0,0,"-"]
[288,null,null,null,null,null,null,null,null,null,null,{"$f":"IFERROR(VLOOKUP(G289,MinimumWages!$A$1:$R$60,MATCH(Employee_Data!H289,MinimumWages!$A$1:$R$1,0),0),0)","v":0},0,{"$f":"ROUND(MAX(ROUNDUP(IF(K289>30000,K289/2,L289/3*2),-2),IFERROR(VLOOKUP(G289,MinimumWages!$A$1:$R$60,(MATCH(Employee_Data!H289,MinimumWages!$A$1:$R$1,0)-4),0),0)),0)","v":0},0,0,0,0,0,0,0,0,0,0,0,0,0,0,0,0,0,"-"]
[289,null,null,null,null,null,null,null,null,null,null,{"$f":"IFERROR(VLOOKUP(G290,MinimumWages!$A$1:$R$60,MATCH(Employee_Data!H290,MinimumWages!$A$1:$R$1,0),0),0)","v":0},0,{"$f":"ROUND(MAX(ROUNDUP(IF(K290>30000,K290/2,L290/3*2),-2),IFERROR(VLOOKUP(G290,MinimumWages!$A$1:$R$60,(MATCH(Employee_Data!H290,MinimumWages!$A$1:$R$1,0)-4),0),0)),0)","v":0},0,0,0,0,0,0,0,0,0,0,0,0,0,0,0,0,0,"-"]
[290,null,null,null,null,null,null,null,null,null,null,{"$f":"IFERROR(VLOOKUP(G291,MinimumWages!$A$1:$R$60,MATCH(Employee_Data!H291,MinimumWages!$A$1:$R$1,0),0),0)","v":0},0,{"$f":"ROUND(MAX(ROUNDUP(IF(K291>30000,K291/2,L291/3*2),-2),IFERROR(VLOOKUP(G291,MinimumWages!$A$1:$R$60,(MATCH(Employee_Data!H291,MinimumWages!$A$1:$R$1,0)-4),0),0)),0)","v":0},0,0,0,0,0,0,0,0,0,0,0,0,0,0,0,0,0,"-"]
[291,null,null,null,null,null,null,null,null,null,null,{"$f":"IFERROR(VLOOKUP(G292,MinimumWages!$A$1:$R$60,MATCH(Employee_Data!H292,MinimumWages!$A$1:$R$1,0),0),0)","v":0},0,{"$f":"ROUND(MAX(ROUNDUP(IF(K292>30000,K292/2,L292/3*2),-2),IFERROR(VLOOKUP(G292,MinimumWages!$A$1:$R$60,(MATCH(Employee_Data!H292,MinimumWages!$A$1:$R$1,0)-4),0),0)),0)","v":0},0,0,0,0,0,0,0,0,0,0,0,0,0,0,0,0,0,"-"]
[292,null,null,null,null,null,null,null,null,null,null,{"$f":"IFERROR(VLOOKUP(G293,MinimumWages!$A$1:$R$60,MATCH(Employee_Data!H293,MinimumWages!$A$1:$R$1,0),0),0)","v":0},0,{"$f":"ROUND(MAX(ROUNDUP(IF(K293>30000,K293/2,L293/3*2),-2),IFERROR(VLOOKUP(G293,MinimumWages!$A$1:$R$60,(MATCH(Employee_Data!H293,MinimumWages!$A$1:$R$1,0)-4),0),0)),0)","v":0},0,0,0,0,0,0,0,0,0,0,0,0,0,0,0,0,0,"-"]
[293,null,null,null,null,null,null,null,null,null,null,{"$f":"IFERROR(VLOOKUP(G294,MinimumWages!$A$1:$R$60,MATCH(Employee_Data!H294,MinimumWages!$A$1:$R$1,0),0),0)","v":0},0,{"$f":"ROUND(MAX(ROUNDUP(IF(K294>30000,K294/2,L294/3*2),-2),IFERROR(VLOOKUP(G294,MinimumWages!$A$1:$R$60,(MATCH(Employee_Data!H294,MinimumWages!$A$1:$R$1,0)-4),0),0)),0)","v":0},0,0,0,0,0,0,0,0,0,0,0,0,0,0,0,0,0,"-"]
[294,null,null,null,null,null,null,null,null,null,null,{"$f":"IFERROR(VLOOKUP(G295,MinimumWages!$A$1:$R$60,MATCH(Employee_Data!H295,MinimumWages!$A$1:$R$1,0),0),0)","v":0},0,{"$f":"ROUND(MAX(ROUNDUP(IF(K295>30000,K295/2,L295/3*2),-2),IFERROR(VLOOKUP(G295,MinimumWages!$A$1:$R$60,(MATCH(Employee_Data!H295,MinimumWages!$A$1:$R$1,0)-4),0),0)),0)","v":0},0,0,0,0,0,0,0,0,0,0,0,0,0,0,0,0,0,"-"]
[295,null,null,null,null,null,null,null,null,null,null,{"$f":"IFERROR(VLOOKUP(G296,MinimumWages!$A$1:$R$60,MATCH(Employee_Data!H296,MinimumWages!$A$1:$R$1,0),0),0)","v":0},0,{"$f":"ROUND(MAX(ROUNDUP(IF(K296>30000,K296/2,L296/3*2),-2),IFERROR(VLOOKUP(G296,MinimumWages!$A$1:$R$60,(MATCH(Employee_Data!H296,MinimumWages!$A$1:$R$1,0)-4),0),0)),0)","v":0},0,0,0,0,0,0,0,0,0,0,0,0,0,0,0,0,0,"-"]
[296,null,null,null,null,null,null,null,null,null,null,{"$f":"IFERROR(VLOOKUP(G297,MinimumWages!$A$1:$R$60,MATCH(Employee_Data!H297,MinimumWages!$A$1:$R$1,0),0),0)","v":0},0,{"$f":"ROUND(MAX(ROUNDUP(IF(K297>30000,K297/2,L297/3*2),-2),IFERROR(VLOOKUP(G297,MinimumWages!$A$1:$R$60,(MATCH(Employee_Data!H297,MinimumWages!$A$1:$R$1,0)-4),0),0)),0)","v":0},0,0,0,0,0,0,0,0,0,0,0,0,0,0,0,0,0,"-"]
[297,null,null,null,null,null,null,null,null,null,null,{"$f":"IFERROR(VLOOKUP(G298,MinimumWages!$A$1:$R$60,MATCH(Employee_Data!H298,MinimumWages!$A$1:$R$1,0),0),0)","v":0},0,{"$f":"ROUND(MAX(ROUNDUP(IF(K298>30000,K298/2,L298/3*2),-2),IFERROR(VLOOKUP(G298,MinimumWages!$A$1:$R$60,(MATCH(Employee_Data!H298,MinimumWages!$A$1:$R$1,0)-4),0),0)),0)","v":0},0,0,0,0,0,0,0,0,0,0,0,0,0,0,0,0,0,"-"]
[298,null,null,null,null,null,null,null,null,null,null,{"$f":"IFERROR(VLOOKUP(G299,MinimumWages!$A$1:$R$60,MATCH(Employee_Data!H299,MinimumWages!$A$1:$R$1,0),0),0)","v":0},0,{"$f":"ROUND(MAX(ROUNDUP(IF(K299>30000,K299/2,L299/3*2),-2),IFERROR(VLOOKUP(G299,MinimumWages!$A$1:$R$60,(MATCH(Employee_Data!H299,MinimumWages!$A$1:$R$1,0)-4),0),0)),0)","v":0},0,0,0,0,0,0,0,0,0,0,0,0,0,0,0,0,0,"-"]
[299,null,null,null,null,null,null,null,null,null,null,{"$f":"IFERROR(VLOOKUP(G300,MinimumWages!$A$1:$R$60,MATCH(Employee_Data!H300,MinimumWages!$A$1:$R$1,0),0),0)","v":0},0,{"$f":"ROUND(MAX(ROUNDUP(IF(K300>30000,K300/2,L300/3*2),-2),IFERROR(VLOOKUP(G300,MinimumWages!$A$1:$R$60,(MATCH(Employee_Data!H300,MinimumWages!$A$1:$R$1,0)-4),0),0)),0)","v":0},0,0,0,0,0,0,0,0,0,0,0,0,0,0,0,0,0,"-"]
[300,null,null,null,null,null,null,null,null,null,null,{"$f":"IFERROR(VLOOKUP(G301,MinimumWages!$A$1:$R$60,MATCH(Employee_Data!H301,MinimumWages!$A$1:$R$1,0),0),0)","v":0},0,{"$f":"ROUND(MAX(ROUNDUP(IF(K301>30000,K301/2,L301/3*2),-2),IFERROR(VLOOKUP(G301,MinimumWages!$A$1:$R$60,(MATCH(Employee_Data!H301,MinimumWages!$A$1:$R$1,0)-4),0),0)),0)","v":0},0,0,0,0,0,0,0,0,0,0,0,0,0,0,0,0,0,"-"]
[301,null,null,null,null,null,null,null,null,null,null,{"$f":"IFERROR(VLOOKUP(G302,MinimumWages!$A$1:$R$60,MATCH(Employee_Data!H302,MinimumWages!$A$1:$R$1,0),0),0)","v":0},0,{"$f":"ROUND(MAX(ROUNDUP(IF(K302>30000,K302/2,L302/3*2),-2),IFERROR(VLOOKUP(G302,MinimumWages!$A$1:$R$60,(MATCH(Employee_Data!H302,MinimumWages!$A$1:$R$1,0)-4),0),0)),0)","v":0},0,0,0,0,0,0,0,0,0,0,0,0,0,0,0,0,0,"-"]
[302,null,null,null,null,null,null,null,null,null,null,{"$f":"IFERROR(VLOOKUP(G303,MinimumWages!$A$1:$R$60,MATCH(Employee_Data!H303,MinimumWages!$A$1:$R$1,0),0),0)","v":0},0,{"$f":"ROUND(MAX(ROUNDUP(IF(K303>30000,K303/2,L303/3*2),-2),IFERROR(VLOOKUP(G303,MinimumWages!$A$1:$R$60,(MATCH(Employee_Data!H303,MinimumWages!$A$1:$R$1,0)-4),0),0)),0)","v":0},0,0,0,0,0,0,0,0,0,0,0,0,0,0,0,0,0,"-"]
[303,null,null,null,null,null,null,null,null,null,null,{"$f":"IFERROR(VLOOKUP(G304,MinimumWages!$A$1:$R$60,MATCH(Employee_Data!H304,MinimumWages!$A$1:$R$1,0),0),0)","v":0},0,{"$f":"ROUND(MAX(ROUNDUP(IF(K304>30000,K304/2,L304/3*2),-2),IFERROR(VLOOKUP(G304,MinimumWages!$A$1:$R$60,(MATCH(Employee_Data!H304,MinimumWages!$A$1:$R$1,0)-4),0),0)),0)","v":0},0,0,0,0,0,0,0,0,0,0,0,0,0,0,0,0,0,"-"]
[304,null,null,null,null,null,null,null,null,null,null,{"$f":"IFERROR(VLOOKUP(G305,MinimumWages!$A$1:$R$60,MATCH(Employee_Data!H305,MinimumWages!$A$1:$R$1,0),0),0)","v":0},0,{"$f":"ROUND(MAX(ROUNDUP(IF(K305>30000,K305/2,L305/3*2),-2),IFERROR(VLOOKUP(G305,MinimumWages!$A$1:$R$60,(MATCH(Employee_Data!H305,MinimumWages!$A$1:$R$1,0)-4),0),0)),0)","v":0},0,0,0,0,0,0,0,0,0,0,0,0,0,0,0,0,0,"-"]
[305,null,null,null,null,null,null,null,null,null,null,{"$f":"IFERROR(VLOOKUP(G306,MinimumWages!$A$1:$R$60,MATCH(Employee_Data!H306,MinimumWages!$A$1:$R$1,0),0),0)","v":0},0,{"$f":"ROUND(MAX(ROUNDUP(IF(K306>30000,K306/2,L306/3*2),-2),IFERROR(VLOOKUP(G306,MinimumWages!$A$1:$R$60,(MATCH(Employee_Data!H306,MinimumWages!$A$1:$R$1,0)-4),0),0)),0)","v":0},0,0,0,0,0,0,0,0,0,0,0,0,0,0,0,0,0,"-"]
[306,null,null,null,null,null,null,null,null,null,null,{"$f":"IFERROR(VLOOKUP(G307,MinimumWages!$A$1:$R$60,MATCH(Employee_Data!H307,MinimumWages!$A$1:$R$1,0),0),0)","v":0},0,{"$f":"ROUND(MAX(ROUNDUP(IF(K307>30000,K307/2,L307/3*2),-2),IFERROR(VLOOKUP(G307,MinimumWages!$A$1:$R$60,(MATCH(Employee_Data!H307,MinimumWages!$A$1:$R$1,0)-4),0),0)),0)","v":0},0,0,0,0,0,0,0,0,0,0,0,0,0,0,0,0,0,"-"]
[307,null,null,null,null,null,null,null,null,null,null,{"$f":"IFERROR(VLOOKUP(G308,MinimumWages!$A$1:$R$60,MATCH(Employee_Data!H308,MinimumWages!$A$1:$R$1,0),0),0)","v":0},0,{"$f":"ROUND(MAX(ROUNDUP(IF(K308>30000,K308/2,L308/3*2),-2),IFERROR(VLOOKUP(G308,MinimumWages!$A$1:$R$60,(MATCH(Employee_Data!H308,MinimumWages!$A$1:$R$1,0)-4),0),0)),0)","v":0},0,0,0,0,0,0,0,0,0,0,0,0,0,0,0,0,0,"-"]
[308,null,null,null,null,null,null,null,null,null,null,{"$f":"IFERROR(VLOOKUP(G309,MinimumWages!$A$1:$R$60,MATCH(Employee_Data!H309,MinimumWages!$A$1:$R$1,0),0),0)","v":0},0,{"$f":"ROUND(MAX(ROUNDUP(IF(K309>30000,K309/2,L309/3*2),-2),IFERROR(VLOOKUP(G309,MinimumWages!$A$1:$R$60,(MATCH(Employee_Data!H309,MinimumWages!$A$1:$R$1,0)-4),0),0)),0)","v":0},0,0,0,0,0,0,0,0,0,0,0,0,0,0,0,0,0,"-"]
[309,null,null,null,null,null,null,null,null,null,null,{"$f":"IFERROR(VLOOKUP(G310,MinimumWages!$A$1:$R$60,MATCH(Employee_Data!H310,MinimumWages!$A$1:$R$1,0),0),0)","v":0},0,{"$f":"ROUND(MAX(ROUNDUP(IF(K310>30000,K310/2,L310/3*2),-2),IFERROR(VLOOKUP(G310,MinimumWages!$A$1:$R$60,(MATCH(Employee_Data!H310,MinimumWages!$A$1:$R$1,0)-4),0),0)),0)","v":0},0,0,0,0,0,0,0,0,0,0,0,0,0,0,0,0,0,"-"]
[310,null,null,null,null,null,null,null,null,null,null,{"$f":"IFERROR(VLOOKUP(G311,MinimumWages!$A$1:$R$60,MATCH(Employee_Data!H311,MinimumWages!$A$1:$R$1,0),0),0)","v":0},0,{"$f":"ROUND(MAX(ROUNDUP(IF(K311>30000,K311/2,L311/3*2),-2),IFERROR(VLOOKUP(G311,MinimumWages!$A$1:$R$60,(MATCH(Employee_Data!H311,MinimumWages!$A$1:$R$1,0)-4),0),0)),0)","v":0},0,0,0,0,0,0,0,0,0,0,0,0,0,0,0,0,0,"-"]
[311,null,null,null,null,null,null,null,null,null,null,{"$f":"IFERROR(VLOOKUP(G312,MinimumWages!$A$1:$R$60,MATCH(Employee_Data!H312,MinimumWages!$A$1:$R$1,0),0),0)","v":0},0,{"$f":"ROUND(MAX(ROUNDUP(IF(K312>30000,K312/2,L312/3*2),-2),IFERROR(VLOOKUP(G312,MinimumWages!$A$1:$R$60,(MATCH(Employee_Data!H312,MinimumWages!$A$1:$R$1,0)-4),0),0)),0)","v":0},0,0,0,0,0,0,0,0,0,0,0,0,0,0,0,0,0,"-"]
[312,null,null,null,null,null,null,null,null,null,null,{"$f":"IFERROR(VLOOKUP(G313,MinimumWages!$A$1:$R$60,MATCH(Employee_Data!H313,MinimumWages!$A$1:$R$1,0),0),0)","v":0},0,{"$f":"ROUND(MAX(ROUNDUP(IF(K313>30000,K313/2,L313/3*2),-2),IFERROR(VLOOKUP(G313,MinimumWages!$A$1:$R$60,(MATCH(Employee_Data!H313,MinimumWages!$A$1:$R$1,0)-4),0),0)),0)","v":0},0,0,0,0,0,0,0,0,0,0,0,0,0,0,0,0,0,"-"]
[313,null,null,null,null,null,null,null,null,null,null,{"$f":"IFERROR(VLOOKUP(G314,MinimumWages!$A$1:$R$60,MATCH(Employee_Data!H314,MinimumWages!$A$1:$R$1,0),0),0)","v":0},0,{"$f":"ROUND(MAX(ROUNDUP(IF(K314>30000,K314/2,L314/3*2),-2),IFERROR(VLOOKUP(G314,MinimumWages!$A$1:$R$60,(MATCH(Employee_Data!H314,MinimumWages!$A$1:$R$1,0)-4),0),0)),0)","v":0},0,0,0,0,0,0,0,0,0,0,0,0,0,0,0,0,0,"-"]
[314,null,null,null,null,null,null,null,null,null,null,{"$f":"IFERROR(VLOOKUP(G315,MinimumWages!$A$1:$R$60,MATCH(Employee_Data!H315,MinimumWages!$A$1:$R$1,0),0),0)","v":0},0,{"$f":"ROUND(MAX(ROUNDUP(IF(K315>30000,K315/2,L315/3*2),-2),IFERROR(VLOOKUP(G315,MinimumWages!$A$1:$R$60,(MATCH(Employee_Data!H315,MinimumWages!$A$1:$R$1,0)-4),0),0)),0)","v":0},0,0,0,0,0,0,0,0,0,0,0,0,0,0,0,0,0,"-"]
[315,null,null,null,null,null,null,null,null,null,null,{"$f":"IFERROR(VLOOKUP(G316,MinimumWages!$A$1:$R$60,MATCH(Employee_Data!H316,MinimumWages!$A$1:$R$1,0),0),0)","v":0},0,{"$f":"ROUND(MAX(ROUNDUP(IF(K316>30000,K316/2,L316/3*2),-2),IFERROR(VLOOKUP(G316,MinimumWages!$A$1:$R$60,(MATCH(Employee_Data!H316,MinimumWages!$A$1:$R$1,0)-4),0),0)),0)","v":0},0,0,0,0,0,0,0,0,0,0,0,0,0,0,0,0,0,"-"]
[316,null,null,null,null,null,null,null,null,null,null,{"$f":"IFERROR(VLOOKUP(G317,MinimumWages!$A$1:$R$60,MATCH(Employee_Data!H317,MinimumWages!$A$1:$R$1,0),0),0)","v":0},0,{"$f":"ROUND(MAX(ROUNDUP(IF(K317>30000,K317/2,L317/3*2),-2),IFERROR(VLOOKUP(G317,MinimumWages!$A$1:$R$60,(MATCH(Employee_Data!H317,MinimumWages!$A$1:$R$1,0)-4),0),0)),0)","v":0},0,0,0,0,0,0,0,0,0,0,0,0,0,0,0,0,0,"-"]
[317,null,null,null,null,null,null,null,null,null,null,{"$f":"IFERROR(VLOOKUP(G318,MinimumWages!$A$1:$R$60,MATCH(Employee_Data!H318,MinimumWages!$A$1:$R$1,0),0),0)","v":0},0,{"$f":"ROUND(MAX(ROUNDUP(IF(K318>30000,K318/2,L318/3*2),-2),IFERROR(VLOOKUP(G318,MinimumWages!$A$1:$R$60,(MATCH(Employee_Data!H318,MinimumWages!$A$1:$R$1,0)-4),0),0)),0)","v":0},0,0,0,0,0,0,0,0,0,0,0,0,0,0,0,0,0,"-"]
[318,null,null,null,null,null,null,null,null,null,null,{"$f":"IFERROR(VLOOKUP(G319,MinimumWages!$A$1:$R$60,MATCH(Employee_Data!H319,MinimumWages!$A$1:$R$1,0),0),0)","v":0},0,{"$f":"ROUND(MAX(ROUNDUP(IF(K319>30000,K319/2,L319/3*2),-2),IFERROR(VLOOKUP(G319,MinimumWages!$A$1:$R$60,(MATCH(Employee_Data!H319,MinimumWages!$A$1:$R$1,0)-4),0),0)),0)","v":0},0,0,0,0,0,0,0,0,0,0,0,0,0,0,0,0,0,"-"]
[319,null,null,null,null,null,null,null,null,null,null,{"$f":"IFERROR(VLOOKUP(G320,MinimumWages!$A$1:$R$60,MATCH(Employee_Data!H320,MinimumWages!$A$1:$R$1,0),0),0)","v":0},0,{"$f":"ROUND(MAX(ROUNDUP(IF(K320>30000,K320/2,L320/3*2),-2),IFERROR(VLOOKUP(G320,MinimumWages!$A$1:$R$60,(MATCH(Employee_Data!H320,MinimumWages!$A$1:$R$1,0)-4),0),0)),0)","v":0},0,0,0,0,0,0,0,0,0,0,0,0,0,0,0,0,0,"-"]
[320,null,null,null,null,null,null,null,null,null,null,{"$f":"IFERROR(VLOOKUP(G321,MinimumWages!$A$1:$R$60,MATCH(Employee_Data!H321,MinimumWages!$A$1:$R$1,0),0),0)","v":0},0,{"$f":"ROUND(MAX(ROUNDUP(IF(K321>30000,K321/2,L321/3*2),-2),IFERROR(VLOOKUP(G321,MinimumWages!$A$1:$R$60,(MATCH(Employee_Data!H321,MinimumWages!$A$1:$R$1,0)-4),0),0)),0)","v":0},0,0,0,0,0,0,0,0,0,0,0,0,0,0,0,0,0,"-"]
[321,null,null,null,null,null,null,null,null,null,null,{"$f":"IFERROR(VLOOKUP(G322,MinimumWages!$A$1:$R$60,MATCH(Employee_Data!H322,MinimumWages!$A$1:$R$1,0),0),0)","v":0},0,{"$f":"ROUND(MAX(ROUNDUP(IF(K322>30000,K322/2,L322/3*2),-2),IFERROR(VLOOKUP(G322,MinimumWages!$A$1:$R$60,(MATCH(Employee_Data!H322,MinimumWages!$A$1:$R$1,0)-4),0),0)),0)","v":0},0,0,0,0,0,0,0,0,0,0,0,0,0,0,0,0,0,"-"]
[{"$f":"ROW()-1","v":322},null,null,null,null,null,null,null,null,null,null,{"$f":"IFERROR(VLOOKUP(G323,MinimumWages!$A$1:$R$60,MATCH(Employee_Data!H323,MinimumWages!$A$1:$R$1,0),0),0)","v":0},0,{"$f":"ROUND(MAX(ROUNDUP(IF(K323>30000,K323/2,L323/3*2),-2),IFERROR(VLOOKUP(G323,MinimumWages!$A$1:$R$60,(MATCH(Employee_Data!H323,MinimumWages!$A$1:$R$1,0)-4),0),0)),0)","v":0},0,0,0,0,0,0,0,0,0,0,0,0,0,0,0,{"$f":"ROUND(AC323*12,0)","v":0},0,"-"]
[323,null,null,null,null,null,null,null,null,null,null,{"$f":"IFERROR(VLOOKUP(G324,MinimumWages!$A$1:$R$60,MATCH(Employee_Data!H324,MinimumWages!$A$1:$R$1,0),0),0)","v":0},0,{"$f":"ROUND(MAX(ROUNDUP(IF(K324>30000,K324/2,L324/3*2),-2),IFERROR(VLOOKUP(G324,MinimumWages!$A$1:$R$60,(MATCH(Employee_Data!H324,MinimumWages!$A$1:$R$1,0)-4),0),0)),0)","v":0},0,0,0,0,0,0,0,0,0,0,0,0,0,0,0,0,0,"-"]
[324,null,null,null,null,null,null,null,null,null,null,{"$f":"IFERROR(VLOOKUP(G325,MinimumWages!$A$1:$R$60,MATCH(Employee_Data!H325,MinimumWages!$A$1:$R$1,0),0),0)","v":0},0,{"$f":"ROUND(MAX(ROUNDUP(IF(K325>30000,K325/2,L325/3*2),-2),IFERROR(VLOOKUP(G325,MinimumWages!$A$1:$R$60,(MATCH(Employee_Data!H325,MinimumWages!$A$1:$R$1,0)-4),0),0)),0)","v":0},0,0,0,0,0,0,0,0,0,0,0,0,0,0,0,0,0,"-"]
[325,null,null,null,null,null,null,null,null,null,null,{"$f":"IFERROR(VLOOKUP(G326,MinimumWages!$A$1:$R$60,MATCH(Employee_Data!H326,MinimumWages!$A$1:$R$1,0),0),0)","v":0},0,{"$f":"ROUND(MAX(ROUNDUP(IF(K326>30000,K326/2,L326/3*2),-2),IFERROR(VLOOKUP(G326,MinimumWages!$A$1:$R$60,(MATCH(Employee_Data!H326,MinimumWages!$A$1:$R$1,0)-4),0),0)),0)","v":0},0,0,0,0,0,0,0,0,0,0,0,0,0,0,0,0,0,"-"]
[326,null,null,null,null,null,null,null,null,null,null,{"$f":"IFERROR(VLOOKUP(G327,MinimumWages!$A$1:$R$60,MATCH(Employee_Data!H327,MinimumWages!$A$1:$R$1,0),0),0)","v":0},0,{"$f":"ROUND(MAX(ROUNDUP(IF(K327>30000,K327/2,L327/3*2),-2),IFERROR(VLOOKUP(G327,MinimumWages!$A$1:$R$60,(MATCH(Employee_Data!H327,MinimumWages!$A$1:$R$1,0)-4),0),0)),0)","v":0},0,0,0,0,0,0,0,0,0,0,0,0,0,0,0,0,0,"-"]
[327,null,null,null,null,null,null,null,null,null,null,{"$f":"IFERROR(VLOOKUP(G328,MinimumWages!$A$1:$R$60,MATCH(Employee_Data!H328,MinimumWages!$A$1:$R$1,0),0),0)","v":0},0,{"$f":"ROUND(MAX(ROUNDUP(IF(K328>30000,K328/2,L328/3*2),-2),IFERROR(VLOOKUP(G328,MinimumWages!$A$1:$R$60,(MATCH(Employee_Data!H328,MinimumWages!$A$1:$R$1,0)-4),0),0)),0)","v":0},0,0,0,0,0,0,0,0,0,0,0,0,0,0,0,0,0,"-"]
[328,null,null,null,null,null,null,null,null,null,null,{"$f":"IFERROR(VLOOKUP(G329,MinimumWages!$A$1:$R$60,MATCH(Employee_Data!H329,MinimumWages!$A$1:$R$1,0),0),0)","v":0},0,{"$f":"ROUND(MAX(ROUNDUP(IF(K329>30000,K329/2,L329/3*2),-2),IFERROR(VLOOKUP(G329,MinimumWages!$A$1:$R$60,(MATCH(Employee_Data!H329,MinimumWages!$A$1:$R$1,0)-4),0),0)),0)","v":0},0,0,0,0,0,0,0,0,0,0,0,0,0,0,0,0,0,"-"]
[329,null,null,null,null,null,null,null,null,null,null,{"$f":"IFERROR(VLOOKUP(G330,MinimumWages!$A$1:$R$60,MATCH(Employee_Data!H330,MinimumWages!$A$1:$R$1,0),0),0)","v":0},0,{"$f":"ROUND(MAX(ROUNDUP(IF(K330>30000,K330/2,L330/3*2),-2),IFERROR(VLOOKUP(G330,MinimumWages!$A$1:$R$60,(MATCH(Employee_Data!H330,MinimumWages!$A$1:$R$1,0)-4),0),0)),0)","v":0},0,0,0,0,0,0,0,0,0,0,0,0,0,0,0,0,0,"-"]
[330,null,null,null,null,null,null,null,null,null,null,{"$f":"IFERROR(VLOOKUP(G331,MinimumWages!$A$1:$R$60,MATCH(Employee_Data!H331,MinimumWages!$A$1:$R$1,0),0),0)","v":0},0,{"$f":"ROUND(MAX(ROUNDUP(IF(K331>30000,K331/2,L331/3*2),-2),IFERROR(VLOOKUP(G331,MinimumWages!$A$1:$R$60,(MATCH(Employee_Data!H331,MinimumWages!$A$1:$R$1,0)-4),0),0)),0)","v":0},0,0,0,0,0,0,0,0,0,0,0,0,0,0,0,0,0,"-"]
[331,null,null,null,null,null,null,null,null,null,null,{"$f":"IFERROR(VLOOKUP(G332,MinimumWages!$A$1:$R$60,MATCH(Employee_Data!H332,MinimumWages!$A$1:$R$1,0),0),0)","v":0},0,{"$f":"ROUND(MAX(ROUNDUP(IF(K332>30000,K332/2,L332/3*2),-2),IFERROR(VLOOKUP(G332,MinimumWages!$A$1:$R$60,(MATCH(Employee_Data!H332,MinimumWages!$A$1:$R$1,0)-4),0),0)),0)","v":0},0,0,0,0,0,0,0,0,0,0,0,0,0,0,0,0,0,"-"]
[332,null,null,null,null,null,null,null,null,null,null,{"$f":"IFERROR(VLOOKUP(G333,MinimumWages!$A$1:$R$60,MATCH(Employee_Data!H333,MinimumWages!$A$1:$R$1,0),0),0)","v":0},0,{"$f":"ROUND(MAX(ROUNDUP(IF(K333>30000,K333/2,L333/3*2),-2),IFERROR(VLOOKUP(G333,MinimumWages!$A$1:$R$60,(MATCH(Employee_Data!H333,MinimumWages!$A$1:$R$1,0)-4),0),0)),0)","v":0},0,0,0,0,0,0,0,0,0,0,0,0,0,0,0,0,0,"-"]
[333,null,null,null,null,null,null,null,null,null,null,{"$f":"IFERROR(VLOOKUP(G334,MinimumWages!$A$1:$R$60,MATCH(Employee_Data!H334,MinimumWages!$A$1:$R$1,0),0),0)","v":0},0,{"$f":"ROUND(MAX(ROUNDUP(IF(K334>30000,K334/2,L334/3*2),-2),IFERROR(VLOOKUP(G334,MinimumWages!$A$1:$R$60,(MATCH(Employee_Data!H334,MinimumWages!$A$1:$R$1,0)-4),0),0)),0)","v":0},0,0,0,0,0,0,0,0,0,0,0,0,0,0,0,0,0,"-"]
[334,null,null,null,null,null,null,null,null,null,null,{"$f":"IFERROR(VLOOKUP(G335,MinimumWages!$A$1:$R$60,MATCH(Employee_Data!H335,MinimumWages!$A$1:$R$1,0),0),0)","v":0},0,{"$f":"ROUND(MAX(ROUNDUP(IF(K335>30000,K335/2,L335/3*2),-2),IFERROR(VLOOKUP(G335,MinimumWages!$A$1:$R$60,(MATCH(Employee_Data!H335,MinimumWages!$A$1:$R$1,0)-4),0),0)),0)","v":0},0,0,0,0,0,0,0,0,0,0,0,0,0,0,0,0,0,"-"]
[335,null,null,null,null,null,null,null,null,null,null,{"$f":"IFERROR(VLOOKUP(G336,MinimumWages!$A$1:$R$60,MATCH(Employee_Data!H336,MinimumWages!$A$1:$R$1,0),0),0)","v":0},0,{"$f":"ROUND(MAX(ROUNDUP(IF(K336>30000,K336/2,L336/3*2),-2),IFERROR(VLOOKUP(G336,MinimumWages!$A$1:$R$60,(MATCH(Employee_Data!H336,MinimumWages!$A$1:$R$1,0)-4),0),0)),0)","v":0},0,0,0,0,0,0,0,0,0,0,0,0,0,0,0,0,0,"-"]
[336,null,null,null,null,null,null,null,null,null,null,{"$f":"IFERROR(VLOOKUP(G337,MinimumWages!$A$1:$R$60,MATCH(Employee_Data!H337,MinimumWages!$A$1:$R$1,0),0),0)","v":0},0,{"$f":"ROUND(MAX(ROUNDUP(IF(K337>30000,K337/2,L337/3*2),-2),IFERROR(VLOOKUP(G337,MinimumWages!$A$1:$R$60,(MATCH(Employee_Data!H337,MinimumWages!$A$1:$R$1,0)-4),0),0)),0)","v":0},0,0,0,0,0,0,0,0,0,0,0,0,0,0,0,0,0,"-"]
[337,null,null,null,null,null,null,null,null,null,null,{"$f":"IFERROR(VLOOKUP(G338,MinimumWages!$A$1:$R$60,MATCH(Employee_Data!H338,MinimumWages!$A$1:$R$1,0),0),0)","v":0},0,{"$f":"ROUND(MAX(ROUNDUP(IF(K338>30000,K338/2,L338/3*2),-2),IFERROR(VLOOKUP(G338,MinimumWages!$A$1:$R$60,(MATCH(Employee_Data!H338,MinimumWages!$A$1:$R$1,0)-4),0),0)),0)","v":0},0,0,0,0,0,0,0,0,0,0,0,0,0,0,0,0,0,"-"]
[338,null,null,null,null,null,null,null,null,null,null,{"$f":"IFERROR(VLOOKUP(G339,MinimumWages!$A$1:$R$60,MATCH(Employee_Data!H339,MinimumWages!$A$1:$R$1,0),0),0)","v":0},0,{"$f":"ROUND(MAX(ROUNDUP(IF(K339>30000,K339/2,L339/3*2),-2),IFERROR(VLOOKUP(G339,MinimumWages!$A$1:$R$60,(MATCH(Employee_Data!H339,MinimumWages!$A$1:$R$1,0)-4),0),0)),0)","v":0},0,0,0,0,0,0,0,0,0,0,0,0,0,0,0,0,0,"-"]
[339,null,null,null,null,null,null,null,null,null,null,{"$f":"IFERROR(VLOOKUP(G340,MinimumWages!$A$1:$R$60,MATCH(Employee_Data!H340,MinimumWages!$A$1:$R$1,0),0),0)","v":0},0,{"$f":"ROUND(MAX(ROUNDUP(IF(K340>30000,K340/2,L340/3*2),-2),IFERROR(VLOOKUP(G340,MinimumWages!$A$1:$R$60,(MATCH(Employee_Data!H340,MinimumWages!$A$1:$R$1,0)-4),0),0)),0)","v":0},0,0,0,0,0,0,0,0,0,0,0,0,0,0,0,0,0,"-"]
[340,null,null,null,null,null,null,null,null,null,null,{"$f":"IFERROR(VLOOKUP(G341,MinimumWages!$A$1:$R$60,MATCH(Employee_Data!H341,MinimumWages!$A$1:$R$1,0),0),0)","v":0},0,{"$f":"ROUND(MAX(ROUNDUP(IF(K341>30000,K341/2,L341/3*2),-2),IFERROR(VLOOKUP(G341,MinimumWages!$A$1:$R$60,(MATCH(Employee_Data!H341,MinimumWages!$A$1:$R$1,0)-4),0),0)),0)","v":0},0,0,0,0,0,0,0,0,0,0,0,0,0,0,0,0,0,"-"]
[341,null,null,null,null,null,null,null,null,null,null,{"$f":"IFERROR(VLOOKUP(G342,MinimumWages!$A$1:$R$60,MATCH(Employee_Data!H342,MinimumWages!$A$1:$R$1,0),0),0)","v":0},0,{"$f":"ROUND(MAX(ROUNDUP(IF(K342>30000,K342/2,L342/3*2),-2),IFERROR(VLOOKUP(G342,MinimumWages!$A$1:$R$60,(MATCH(Employee_Data!H342,MinimumWages!$A$1:$R$1,0)-4),0),0)),0)","v":0},0,0,0,0,0,0,0,0,0,0,0,0,0,0,0,0,0,"-"]
[342,null,null,null,null,null,null,null,null,null,null,{"$f":"IFERROR(VLOOKUP(G343,MinimumWages!$A$1:$R$60,MATCH(Employee_Data!H343,MinimumWages!$A$1:$R$1,0),0),0)","v":0},0,{"$f":"ROUND(MAX(ROUNDUP(IF(K343>30000,K343/2,L343/3*2),-2),IFERROR(VLOOKUP(G343,MinimumWages!$A$1:$R$60,(MATCH(Employee_Data!H343,MinimumWages!$A$1:$R$1,0)-4),0),0)),0)","v":0},0,0,0,0,0,0,0,0,0,0,0,0,0,0,0,0,0,"-"]
[343,null,null,null,null,null,null,null,null,null,null,{"$f":"IFERROR(VLOOKUP(G344,MinimumWages!$A$1:$R$60,MATCH(Employee_Data!H344,MinimumWages!$A$1:$R$1,0),0),0)","v":0},0,{"$f":"ROUND(MAX(ROUNDUP(IF(K344>30000,K344/2,L344/3*2),-2),IFERROR(VLOOKUP(G344,MinimumWages!$A$1:$R$60,(MATCH(Employee_Data!H344,MinimumWages!$A$1:$R$1,0)-4),0),0)),0)","v":0},0,0,0,0,0,0,0,0,0,0,0,0,0,0,0,0,0,"-"]
[344,null,null,null,null,null,null,null,null,null,null,{"$f":"IFERROR(VLOOKUP(G345,MinimumWages!$A$1:$R$60,MATCH(Employee_Data!H345,MinimumWages!$A$1:$R$1,0),0),0)","v":0},0,{"$f":"ROUND(MAX(ROUNDUP(IF(K345>30000,K345/2,L345/3*2),-2),IFERROR(VLOOKUP(G345,MinimumWages!$A$1:$R$60,(MATCH(Employee_Data!H345,MinimumWages!$A$1:$R$1,0)-4),0),0)),0)","v":0},0,0,0,0,0,0,0,0,0,0,0,0,0,0,0,0,0,"-"]
[345,null,null,null,null,null,null,null,null,null,null,{"$f":"IFERROR(VLOOKUP(G346,MinimumWages!$A$1:$R$60,MATCH(Employee_Data!H346,MinimumWages!$A$1:$R$1,0),0),0)","v":0},0,{"$f":"ROUND(MAX(ROUNDUP(IF(K346>30000,K346/2,L346/3*2),-2),IFERROR(VLOOKUP(G346,MinimumWages!$A$1:$R$60,(MATCH(Employee_Data!H346,MinimumWages!$A$1:$R$1,0)-4),0),0)),0)","v":0},0,0,0,0,0,0,0,0,0,0,0,0,0,0,0,0,0,"-"]
[346,null,null,null,null,null,null,null,null,null,null,{"$f":"IFERROR(VLOOKUP(G347,MinimumWages!$A$1:$R$60,MATCH(Employee_Data!H347,MinimumWages!$A$1:$R$1,0),0),0)","v":0},0,{"$f":"ROUND(MAX(ROUNDUP(IF(K347>30000,K347/2,L347/3*2),-2),IFERROR(VLOOKUP(G347,MinimumWages!$A$1:$R$60,(MATCH(Employee_Data!H347,MinimumWages!$A$1:$R$1,0)-4),0),0)),0)","v":0},0,0,0,0,0,0,0,0,0,0,0,0,0,0,0,0,0,"-"]
[347,null,null,null,null,null,null,null,null,null,null,{"$f":"IFERROR(VLOOKUP(G348,MinimumWages!$A$1:$R$60,MATCH(Employee_Data!H348,MinimumWages!$A$1:$R$1,0),0),0)","v":0},0,{"$f":"ROUND(MAX(ROUNDUP(IF(K348>30000,K348/2,L348/3*2),-2),IFERROR(VLOOKUP(G348,MinimumWages!$A$1:$R$60,(MATCH(Employee_Data!H348,MinimumWages!$A$1:$R$1,0)-4),0),0)),0)","v":0},0,0,0,0,0,0,0,0,0,0,0,0,0,0,0,0,0,"-"]
[348,null,null,null,null,null,null,null,null,null,null,{"$f":"IFERROR(VLOOKUP(G349,MinimumWages!$A$1:$R$60,MATCH(Employee_Data!H349,MinimumWages!$A$1:$R$1,0),0),0)","v":0},0,{"$f":"ROUND(MAX(ROUNDUP(IF(K349>30000,K349/2,L349/3*2),-2),IFERROR(VLOOKUP(G349,MinimumWages!$A$1:$R$60,(MATCH(Employee_Data!H349,MinimumWages!$A$1:$R$1,0)-4),0),0)),0)","v":0},0,0,0,0,0,0,0,0,0,0,0,0,0,0,0,0,0,"-"]
[349,null,null,null,null,null,null,null,null,null,null,{"$f":"IFERROR(VLOOKUP(G350,MinimumWages!$A$1:$R$60,MATCH(Employee_Data!H350,MinimumWages!$A$1:$R$1,0),0),0)","v":0},0,{"$f":"ROUND(MAX(ROUNDUP(IF(K350>30000,K350/2,L350/3*2),-2),IFERROR(VLOOKUP(G350,MinimumWages!$A$1:$R$60,(MATCH(Employee_Data!H350,MinimumWages!$A$1:$R$1,0)-4),0),0)),0)","v":0},0,0,0,0,0,0,0,0,0,0,0,0,0,0,0,0,0,"-"]
[350,null,null,null,null,null,null,null,null,null,null,{"$f":"IFERROR(VLOOKUP(G351,MinimumWages!$A$1:$R$60,MATCH(Employee_Data!H351,MinimumWages!$A$1:$R$1,0),0),0)","v":0},{"$f":"ROUND(K351*12,0)","v":0},{"$f":"ROUND(MAX(ROUNDUP(IF(K351>30000,K351/2,L351/3*2),-2),IFERROR(VLOOKUP(G351,MinimumWages!$A$1:$R$60,(MATCH(Employee_Data!H351,MinimumWages!$A$1:$R$1,0)-4),0),0)),0)","v":0},{"$f":"ROUND(IF(K351<30000,N351*5%,N351/2),0)","v":0},0,0,0,0,0,0,{"$f":"SUM(N351:U351)","v":0},{"$f":"IF(I351=\"Yes\",ROUND(IF(J351=\"Limit\",MIN((V351-O351),15000),IF(N351>15000,N351,MIN((V351-O351),15000)))*12%,0),0)","v":0},{"$f":"IF(V351>21000,0,ROUNDUP(V351*3.75%,0))","v":0},{"$f":"SUM(V351:X351)","v":0},{"$f":"IF(AND(N351<=21000,K351>0),ROUND(MAX(L351,7000)*8.33%,0),0)","v":0},{"$f":"ROUND(N351/26*15/12,0)","v":0},0,{"$f":"SUM(Y351:AB351)","v":0},0,{"$f":"ROUND((M351-AD351)/12,0)","v":0},{"$f":"IF(AE351<>0,\"Un-Matched CTC\",IF(COUNTIF(N351:AE351,\"<0\")>0,\"Less CTC\",\"-\"))","v":"-"}]
[351,null,null,null,null,null,null,null,null,null,null,{"$f":"IFERROR(VLOOKUP(G352,MinimumWages!$A$1:$R$60,MATCH(Employee_Data!H352,MinimumWages!$A$1:$R$1,0),0),0)","v":0},0,{"$f":"ROUND(MAX(ROUNDUP(IF(K352>30000,K352/2,L352/3*2),-2),IFERROR(VLOOKUP(G352,MinimumWages!$A$1:$R$60,(MATCH(Employee_Data!H352,MinimumWages!$A$1:$R$1,0)-4),0),0)),0)","v":0},0,0,0,0,0,0,0,0,0,0,0,0,0,0,0,0,0,"-"]
[352,null,null,null,null,null,null,null,null,null,null,{"$f":"IFERROR(VLOOKUP(G353,MinimumWages!$A$1:$R$60,MATCH(Employee_Data!H353,MinimumWages!$A$1:$R$1,0),0),0)","v":0},0,{"$f":"ROUND(MAX(ROUNDUP(IF(K353>30000,K353/2,L353/3*2),-2),IFERROR(VLOOKUP(G353,MinimumWages!$A$1:$R$60,(MATCH(Employee_Data!H353,MinimumWages!$A$1:$R$1,0)-4),0),0)),0)","v":0},0,0,0,0,0,0,0,0,0,0,0,0,0,0,0,0,0,"-"]
[353,null,null,null,null,null,null,null,null,null,null,{"$f":"IFERROR(VLOOKUP(G354,MinimumWages!$A$1:$R$60,MATCH(Employee_Data!H354,MinimumWages!$A$1:$R$1,0),0),0)","v":0},0,{"$f":"ROUND(MAX(ROUNDUP(IF(K354>30000,K354/2,L354/3*2),-2),IFERROR(VLOOKUP(G354,MinimumWages!$A$1:$R$60,(MATCH(Employee_Data!H354,MinimumWages!$A$1:$R$1,0)-4),0),0)),0)","v":0},0,0,0,0,0,0,0,0,0,0,0,0,0,0,0,0,0,"-"]
[354,null,null,null,null,null,null,null,null,null,null,{"$f":"IFERROR(VLOOKUP(G355,MinimumWages!$A$1:$R$60,MATCH(Employee_Data!H355,MinimumWages!$A$1:$R$1,0),0),0)","v":0},0,{"$f":"ROUND(MAX(ROUNDUP(IF(K355>30000,K355/2,L355/3*2),-2),IFERROR(VLOOKUP(G355,MinimumWages!$A$1:$R$60,(MATCH(Employee_Data!H355,MinimumWages!$A$1:$R$1,0)-4),0),0)),0)","v":0},0,0,0,0,0,0,0,0,0,0,0,0,0,0,0,0,0,"-"]
[355,null,null,null,null,null,null,null,null,null,null,{"$f":"IFERROR(VLOOKUP(G356,MinimumWages!$A$1:$R$60,MATCH(Employee_Data!H356,MinimumWages!$A$1:$R$1,0),0),0)","v":0},0,{"$f":"ROUND(MAX(ROUNDUP(IF(K356>30000,K356/2,L356/3*2),-2),IFERROR(VLOOKUP(G356,MinimumWages!$A$1:$R$60,(MATCH(Employee_Data!H356,MinimumWages!$A$1:$R$1,0)-4),0),0)),0)","v":0},0,0,0,0,0,0,0,0,0,0,0,0,0,0,0,0,0,"-"]
[356,null,null,null,null,null,null,null,null,null,null,{"$f":"IFERROR(VLOOKUP(G357,MinimumWages!$A$1:$R$60,MATCH(Employee_Data!H357,MinimumWages!$A$1:$R$1,0),0),0)","v":0},0,{"$f":"ROUND(MAX(ROUNDUP(IF(K357>30000,K357/2,L357/3*2),-2),IFERROR(VLOOKUP(G357,MinimumWages!$A$1:$R$60,(MATCH(Employee_Data!H357,MinimumWages!$A$1:$R$1,0)-4),0),0)),0)","v":0},0,0,0,0,0,0,0,0,0,0,0,0,0,0,0,0,0,"-"]
[357,null,null,null,null,null,null,null,null,null,null,{"$f":"IFERROR(VLOOKUP(G358,MinimumWages!$A$1:$R$60,MATCH(Employee_Data!H358,MinimumWages!$A$1:$R$1,0),0),0)","v":0},0,{"$f":"ROUND(MAX(ROUNDUP(IF(K358>30000,K358/2,L358/3*2),-2),IFERROR(VLOOKUP(G358,MinimumWages!$A$1:$R$60,(MATCH(Employee_Data!H358,MinimumWages!$A$1:$R$1,0)-4),0),0)),0)","v":0},0,0,0,0,0,0,0,0,0,0,0,0,0,0,0,0,0,"-"]
[358,null,null,null,null,null,null,null,null,null,null,{"$f":"IFERROR(VLOOKUP(G359,MinimumWages!$A$1:$R$60,MATCH(Employee_Data!H359,MinimumWages!$A$1:$R$1,0),0),0)","v":0},0,{"$f":"ROUND(MAX(ROUNDUP(IF(K359>30000,K359/2,L359/3*2),-2),IFERROR(VLOOKUP(G359,MinimumWages!$A$1:$R$60,(MATCH(Employee_Data!H359,MinimumWages!$A$1:$R$1,0)-4),0),0)),0)","v":0},0,0,0,0,0,0,0,0,0,0,0,0,0,0,0,0,0,"-"]
[359,null,null,null,null,null,null,null,null,null,null,{"$f":"IFERROR(VLOOKUP(G360,MinimumWages!$A$1:$R$60,MATCH(Employee_Data!H360,MinimumWages!$A$1:$R$1,0),0),0)","v":0},0,{"$f":"ROUND(MAX(ROUNDUP(IF(K360>30000,K360/2,L360/3*2),-2),IFERROR(VLOOKUP(G360,MinimumWages!$A$1:$R$60,(MATCH(Employee_Data!H360,MinimumWages!$A$1:$R$1,0)-4),0),0)),0)","v":0},0,0,0,0,0,0,0,0,0,0,0,0,0,0,0,0,0,"-"]
[360,null,null,null,null,null,null,null,null,null,null,{"$f":"IFERROR(VLOOKUP(G361,MinimumWages!$A$1:$R$60,MATCH(Employee_Data!H361,MinimumWages!$A$1:$R$1,0),0),0)","v":0},0,{"$f":"ROUND(MAX(ROUNDUP(IF(K361>30000,K361/2,L361/3*2),-2),IFERROR(VLOOKUP(G361,MinimumWages!$A$1:$R$60,(MATCH(Employee_Data!H361,MinimumWages!$A$1:$R$1,0)-4),0),0)),0)","v":0},0,0,0,0,0,0,0,0,0,0,0,0,0,0,0,0,0,"-"]
[361,null,null,null,null,null,null,null,null,null,null,{"$f":"IFERROR(VLOOKUP(G362,MinimumWages!$A$1:$R$60,MATCH(Employee_Data!H362,MinimumWages!$A$1:$R$1,0),0),0)","v":0},0,{"$f":"ROUND(MAX(ROUNDUP(IF(K362>30000,K362/2,L362/3*2),-2),IFERROR(VLOOKUP(G362,MinimumWages!$A$1:$R$60,(MATCH(Employee_Data!H362,MinimumWages!$A$1:$R$1,0)-4),0),0)),0)","v":0},0,0,0,0,0,0,0,0,0,0,0,0,0,0,0,0,0,"-"]
[362,null,null,null,null,null,null,null,null,null,null,{"$f":"IFERROR(VLOOKUP(G363,MinimumWages!$A$1:$R$60,MATCH(Employee_Data!H363,MinimumWages!$A$1:$R$1,0),0),0)","v":0},0,{"$f":"ROUND(MAX(ROUNDUP(IF(K363>30000,K363/2,L363/3*2),-2),IFERROR(VLOOKUP(G363,MinimumWages!$A$1:$R$60,(MATCH(Employee_Data!H363,MinimumWages!$A$1:$R$1,0)-4),0),0)),0)","v":0},0,0,0,0,0,0,0,0,0,0,0,0,0,0,0,0,0,"-"]
[363,null,null,null,null,null,null,null,null,null,null,{"$f":"IFERROR(VLOOKUP(G364,MinimumWages!$A$1:$R$60,MATCH(Employee_Data!H364,MinimumWages!$A$1:$R$1,0),0),0)","v":0},0,{"$f":"ROUND(MAX(ROUNDUP(IF(K364>30000,K364/2,L364/3*2),-2),IFERROR(VLOOKUP(G364,MinimumWages!$A$1:$R$60,(MATCH(Employee_Data!H364,MinimumWages!$A$1:$R$1,0)-4),0),0)),0)","v":0},0,0,0,0,0,0,0,0,0,0,0,0,0,0,0,0,0,"-"]
[364,null,null,null,null,null,null,null,null,null,null,{"$f":"IFERROR(VLOOKUP(G365,MinimumWages!$A$1:$R$60,MATCH(Employee_Data!H365,MinimumWages!$A$1:$R$1,0),0),0)","v":0},0,{"$f":"ROUND(MAX(ROUNDUP(IF(K365>30000,K365/2,L365/3*2),-2),IFERROR(VLOOKUP(G365,MinimumWages!$A$1:$R$60,(MATCH(Employee_Data!H365,MinimumWages!$A$1:$R$1,0)-4),0),0)),0)","v":0},0,0,0,0,0,0,0,0,0,0,0,0,0,0,0,0,0,"-"]
[365,null,null,null,null,null,null,null,null,null,null,{"$f":"IFERROR(VLOOKUP(G366,MinimumWages!$A$1:$R$60,MATCH(Employee_Data!H366,MinimumWages!$A$1:$R$1,0),0),0)","v":0},0,{"$f":"ROUND(MAX(ROUNDUP(IF(K366>30000,K366/2,L366/3*2),-2),IFERROR(VLOOKUP(G366,MinimumWages!$A$1:$R$60,(MATCH(Employee_Data!H366,MinimumWages!$A$1:$R$1,0)-4),0),0)),0)","v":0},0,0,0,0,0,0,0,0,0,0,0,0,0,0,0,0,0,"-"]
[366,null,null,null,null,null,null,null,null,null,null,{"$f":"IFERROR(VLOOKUP(G367,MinimumWages!$A$1:$R$60,MATCH(Employee_Data!H367,MinimumWages!$A$1:$R$1,0),0),0)","v":0},0,{"$f":"ROUND(MAX(ROUNDUP(IF(K367>30000,K367/2,L367/3*2),-2),IFERROR(VLOOKUP(G367,MinimumWages!$A$1:$R$60,(MATCH(Employee_Data!H367,MinimumWages!$A$1:$R$1,0)-4),0),0)),0)","v":0},0,0,0,0,0,0,0,0,0,0,0,0,0,0,0,0,0,"-"]
[367,null,null,null,null,null,null,null,null,null,null,{"$f":"IFERROR(VLOOKUP(G368,MinimumWages!$A$1:$R$60,MATCH(Employee_Data!H368,MinimumWages!$A$1:$R$1,0),0),0)","v":0},0,{"$f":"ROUND(MAX(ROUNDUP(IF(K368>30000,K368/2,L368/3*2),-2),IFERROR(VLOOKUP(G368,MinimumWages!$A$1:$R$60,(MATCH(Employee_Data!H368,MinimumWages!$A$1:$R$1,0)-4),0),0)),0)","v":0},0,0,0,0,0,0,0,0,0,0,0,0,0,0,0,0,0,"-"]
[368,null,null,null,null,null,null,null,null,null,null,{"$f":"IFERROR(VLOOKUP(G369,MinimumWages!$A$1:$R$60,MATCH(Employee_Data!H369,MinimumWages!$A$1:$R$1,0),0),0)","v":0},0,{"$f":"ROUND(MAX(ROUNDUP(IF(K369>30000,K369/2,L369/3*2),-2),IFERROR(VLOOKUP(G369,MinimumWages!$A$1:$R$60,(MATCH(Employee_Data!H369,MinimumWages!$A$1:$R$1,0)-4),0),0)),0)","v":0},0,0,0,0,0,0,0,0,0,0,0,0,0,0,0,0,0,"-"]
[369,null,null,null,null,null,null,null,null,null,null,{"$f":"IFERROR(VLOOKUP(G370,MinimumWages!$A$1:$R$60,MATCH(Employee_Data!H370,MinimumWages!$A$1:$R$1,0),0),0)","v":0},0,{"$f":"ROUND(MAX(ROUNDUP(IF(K370>30000,K370/2,L370/3*2),-2),IFERROR(VLOOKUP(G370,MinimumWages!$A$1:$R$60,(MATCH(Employee_Data!H370,MinimumWages!$A$1:$R$1,0)-4),0),0)),0)","v":0},0,0,0,0,0,0,0,0,0,0,0,0,0,0,0,0,0,"-"]
[370,null,null,null,null,null,null,null,null,null,null,{"$f":"IFERROR(VLOOKUP(G371,MinimumWages!$A$1:$R$60,MATCH(Employee_Data!H371,MinimumWages!$A$1:$R$1,0),0),0)","v":0},0,{"$f":"ROUND(MAX(ROUNDUP(IF(K371>30000,K371/2,L371/3*2),-2),IFERROR(VLOOKUP(G371,MinimumWages!$A$1:$R$60,(MATCH(Employee_Data!H371,MinimumWages!$A$1:$R$1,0)-4),0),0)),0)","v":0},0,0,0,0,0,0,0,0,0,0,0,0,0,0,0,0,0,"-"]
[371,null,null,null,null,null,null,null,null,null,null,{"$f":"IFERROR(VLOOKUP(G372,MinimumWages!$A$1:$R$60,MATCH(Employee_Data!H372,MinimumWages!$A$1:$R$1,0),0),0)","v":0},0,{"$f":"ROUND(MAX(ROUNDUP(IF(K372>30000,K372/2,L372/3*2),-2),IFERROR(VLOOKUP(G372,MinimumWages!$A$1:$R$60,(MATCH(Employee_Data!H372,MinimumWages!$A$1:$R$1,0)-4),0),0)),0)","v":0},0,0,0,0,0,0,0,0,0,0,0,0,0,0,0,0,0,"-"]
[372,null,null,null,null,null,null,null,null,null,null,{"$f":"IFERROR(VLOOKUP(G373,MinimumWages!$A$1:$R$60,MATCH(Employee_Data!H373,MinimumWages!$A$1:$R$1,0),0),0)","v":0},0,{"$f":"ROUND(MAX(ROUNDUP(IF(K373>30000,K373/2,L373/3*2),-2),IFERROR(VLOOKUP(G373,MinimumWages!$A$1:$R$60,(MATCH(Employee_Data!H373,MinimumWages!$A$1:$R$1,0)-4),0),0)),0)","v":0},0,0,0,0,0,0,0,0,0,0,0,0,0,0,0,0,0,"-"]
[373,null,null,null,null,null,null,null,null,null,null,{"$f":"IFERROR(VLOOKUP(G374,MinimumWages!$A$1:$R$60,MATCH(Employee_Data!H374,MinimumWages!$A$1:$R$1,0),0),0)","v":0},0,{"$f":"ROUND(MAX(ROUNDUP(IF(K374>30000,K374/2,L374/3*2),-2),IFERROR(VLOOKUP(G374,MinimumWages!$A$1:$R$60,(MATCH(Employee_Data!H374,MinimumWages!$A$1:$R$1,0)-4),0),0)),0)","v":0},0,0,0,0,0,0,0,0,0,0,0,0,0,0,0,0,0,"-"]
[374,null,null,null,null,null,null,null,null,null,null,{"$f":"IFERROR(VLOOKUP(G375,MinimumWages!$A$1:$R$60,MATCH(Employee_Data!H375,MinimumWages!$A$1:$R$1,0),0),0)","v":0},0,{"$f":"ROUND(MAX(ROUNDUP(IF(K375>30000,K375/2,L375/3*2),-2),IFERROR(VLOOKUP(G375,MinimumWages!$A$1:$R$60,(MATCH(Employee_Data!H375,MinimumWages!$A$1:$R$1,0)-4),0),0)),0)","v":0},0,0,0,0,0,0,0,0,0,0,0,0,0,0,0,0,0,"-"]
[375,null,null,null,null,null,null,null,null,null,null,{"$f":"IFERROR(VLOOKUP(G376,MinimumWages!$A$1:$R$60,MATCH(Employee_Data!H376,MinimumWages!$A$1:$R$1,0),0),0)","v":0},0,{"$f":"ROUND(MAX(ROUNDUP(IF(K376>30000,K376/2,L376/3*2),-2),IFERROR(VLOOKUP(G376,MinimumWages!$A$1:$R$60,(MATCH(Employee_Data!H376,MinimumWages!$A$1:$R$1,0)-4),0),0)),0)","v":0},0,0,0,0,0,0,0,0,0,0,0,0,0,0,0,0,0,"-"]
[376,null,null,null,null,null,null,null,null,null,null,{"$f":"IFERROR(VLOOKUP(G377,MinimumWages!$A$1:$R$60,MATCH(Employee_Data!H377,MinimumWages!$A$1:$R$1,0),0),0)","v":0},0,{"$f":"ROUND(MAX(ROUNDUP(IF(K377>30000,K377/2,L377/3*2),-2),IFERROR(VLOOKUP(G377,MinimumWages!$A$1:$R$60,(MATCH(Employee_Data!H377,MinimumWages!$A$1:$R$1,0)-4),0),0)),0)","v":0},0,0,0,0,0,0,0,0,0,0,0,0,0,0,0,0,0,"-"]
[377,null,null,null,null,null,null,null,null,null,null,{"$f":"IFERROR(VLOOKUP(G378,MinimumWages!$A$1:$R$60,MATCH(Employee_Data!H378,MinimumWages!$A$1:$R$1,0),0),0)","v":0},0,{"$f":"ROUND(MAX(ROUNDUP(IF(K378>30000,K378/2,L378/3*2),-2),IFERROR(VLOOKUP(G378,MinimumWages!$A$1:$R$60,(MATCH(Employee_Data!H378,MinimumWages!$A$1:$R$1,0)-4),0),0)),0)","v":0},0,0,0,0,0,0,0,0,0,0,0,0,0,0,0,0,0,"-"]
[378,null,null,null,null,null,null,null,null,null,null,{"$f":"IFERROR(VLOOKUP(G379,MinimumWages!$A$1:$R$60,MATCH(Employee_Data!H379,MinimumWages!$A$1:$R$1,0),0),0)","v":0},0,{"$f":"ROUND(MAX(ROUNDUP(IF(K379>30000,K379/2,L379/3*2),-2),IFERROR(VLOOKUP(G379,MinimumWages!$A$1:$R$60,(MATCH(Employee_Data!H379,MinimumWages!$A$1:$R$1,0)-4),0),0)),0)","v":0},0,0,0,0,0,0,0,0,0,0,0,0,0,0,0,0,0,"-"]
[379,null,null,null,null,null,null,null,null,null,null,{"$f":"IFERROR(VLOOKUP(G380,MinimumWages!$A$1:$R$60,MATCH(Employee_Data!H380,MinimumWages!$A$1:$R$1,0),0),0)","v":0},0,{"$f":"ROUND(MAX(ROUNDUP(IF(K380>30000,K380/2,L380/3*2),-2),IFERROR(VLOOKUP(G380,MinimumWages!$A$1:$R$60,(MATCH(Employee_Data!H380,MinimumWages!$A$1:$R$1,0)-4),0),0)),0)","v":0},0,0,0,0,0,0,0,0,0,0,0,0,0,0,0,0,0,"-"]
[380,null,null,null,null,null,null,null,null,null,null,{"$f":"IFERROR(VLOOKUP(G381,MinimumWages!$A$1:$R$60,MATCH(Employee_Data!H381,MinimumWages!$A$1:$R$1,0),0),0)","v":0},0,{"$f":"ROUND(MAX(ROUNDUP(IF(K381>30000,K381/2,L381/3*2),-2),IFERROR(VLOOKUP(G381,MinimumWages!$A$1:$R$60,(MATCH(Employee_Data!H381,MinimumWages!$A$1:$R$1,0)-4),0),0)),0)","v":0},0,0,0,0,0,0,0,0,0,0,0,0,0,0,0,0,0,"-"]
[381,null,null,null,null,null,null,null,null,null,null,{"$f":"IFERROR(VLOOKUP(G382,MinimumWages!$A$1:$R$60,MATCH(Employee_Data!H382,MinimumWages!$A$1:$R$1,0),0),0)","v":0},0,{"$f":"ROUND(MAX(ROUNDUP(IF(K382>30000,K382/2,L382/3*2),-2),IFERROR(VLOOKUP(G382,MinimumWages!$A$1:$R$60,(MATCH(Employee_Data!H382,MinimumWages!$A$1:$R$1,0)-4),0),0)),0)","v":0},0,0,0,0,0,0,0,0,0,0,0,0,0,0,0,0,0,"-"]
[382,null,null,null,null,null,null,null,null,null,null,{"$f":"IFERROR(VLOOKUP(G383,MinimumWages!$A$1:$R$60,MATCH(Employee_Data!H383,MinimumWages!$A$1:$R$1,0),0),0)","v":0},0,{"$f":"ROUND(MAX(ROUNDUP(IF(K383>30000,K383/2,L383/3*2),-2),IFERROR(VLOOKUP(G383,MinimumWages!$A$1:$R$60,(MATCH(Employee_Data!H383,MinimumWages!$A$1:$R$1,0)-4),0),0)),0)","v":0},0,0,0,0,0,0,0,0,0,0,0,0,0,0,0,0,0,"-"]
[383,null,null,null,null,null,null,null,null,null,null,{"$f":"IFERROR(VLOOKUP(G384,MinimumWages!$A$1:$R$60,MATCH(Employee_Data!H384,MinimumWages!$A$1:$R$1,0),0),0)","v":0},0,{"$f":"ROUND(MAX(ROUNDUP(IF(K384>30000,K384/2,L384/3*2),-2),IFERROR(VLOOKUP(G384,MinimumWages!$A$1:$R$60,(MATCH(Employee_Data!H384,MinimumWages!$A$1:$R$1,0)-4),0),0)),0)","v":0},0,0,0,0,0,0,0,0,0,0,0,0,0,0,0,0,0,"-"]
[384,null,null,null,null,null,null,null,null,null,null,{"$f":"IFERROR(VLOOKUP(G385,MinimumWages!$A$1:$R$60,MATCH(Employee_Data!H385,MinimumWages!$A$1:$R$1,0),0),0)","v":0},0,{"$f":"ROUND(MAX(ROUNDUP(IF(K385>30000,K385/2,L385/3*2),-2),IFERROR(VLOOKUP(G385,MinimumWages!$A$1:$R$60,(MATCH(Employee_Data!H385,MinimumWages!$A$1:$R$1,0)-4),0),0)),0)","v":0},0,0,0,0,0,0,0,0,0,0,0,0,0,0,0,0,0,"-"]
[385,null,null,null,null,null,null,null,null,null,null,{"$f":"IFERROR(VLOOKUP(G386,MinimumWages!$A$1:$R$60,MATCH(Employee_Data!H386,MinimumWages!$A$1:$R$1,0),0),0)","v":0},0,{"$f":"ROUND(MAX(ROUNDUP(IF(K386>30000,K386/2,L386/3*2),-2),IFERROR(VLOOKUP(G386,MinimumWages!$A$1:$R$60,(MATCH(Employee_Data!H386,MinimumWages!$A$1:$R$1,0)-4),0),0)),0)","v":0},0,0,0,0,0,0,0,0,0,0,0,0,0,0,0,0,0,"-"]
[{"$f":"ROW()-1","v":386},null,null,null,null,null,null,null,null,null,null,{"$f":"IFERROR(VLOOKUP(G387,MinimumWages!$A$1:$R$60,MATCH(Employee_Data!H387,MinimumWages!$A$1:$R$1,0),0),0)","v":0},0,{"$f":"ROUND(MAX(ROUNDUP(IF(K387>30000,K387/2,L387/3*2),-2),IFERROR(VLOOKUP(G387,MinimumWages!$A$1:$R$60,(MATCH(Employee_Data!H387,MinimumWages!$A$1:$R$1,0)-4),0),0)),0)","v":0},0,0,0,0,0,0,0,0,0,0,0,0,0,0,0,{"$f":"ROUND(AC387*12,0)","v":0},0,"-"]
[387,null,null,null,null,null,null,null,null,null,null,{"$f":"IFERROR(VLOOKUP(G388,MinimumWages!$A$1:$R$60,MATCH(Employee_Data!H388,MinimumWages!$A$1:$R$1,0),0),0)","v":0},0,{"$f":"ROUND(MAX(ROUNDUP(IF(K388>30000,K388/2,L388/3*2),-2),IFERROR(VLOOKUP(G388,MinimumWages!$A$1:$R$60,(MATCH(Employee_Data!H388,MinimumWages!$A$1:$R$1,0)-4),0),0)),0)","v":0},0,0,0,0,0,0,0,0,0,0,0,0,0,0,0,0,0,"-"]
[388,null,null,null,null,null,null,null,null,null,null,{"$f":"IFERROR(VLOOKUP(G389,MinimumWages!$A$1:$R$60,MATCH(Employee_Data!H389,MinimumWages!$A$1:$R$1,0),0),0)","v":0},0,{"$f":"ROUND(MAX(ROUNDUP(IF(K389>30000,K389/2,L389/3*2),-2),IFERROR(VLOOKUP(G389,MinimumWages!$A$1:$R$60,(MATCH(Employee_Data!H389,MinimumWages!$A$1:$R$1,0)-4),0),0)),0)","v":0},0,0,0,0,0,0,0,0,0,0,0,0,0,0,0,0,0,"-"]
[389,null,null,null,null,null,null,null,null,null,null,{"$f":"IFERROR(VLOOKUP(G390,MinimumWages!$A$1:$R$60,MATCH(Employee_Data!H390,MinimumWages!$A$1:$R$1,0),0),0)","v":0},0,{"$f":"ROUND(MAX(ROUNDUP(IF(K390>30000,K390/2,L390/3*2),-2),IFERROR(VLOOKUP(G390,MinimumWages!$A$1:$R$60,(MATCH(Employee_Data!H390,MinimumWages!$A$1:$R$1,0)-4),0),0)),0)","v":0},0,0,0,0,0,0,0,0,0,0,0,0,0,0,0,0,0,"-"]
[390,null,null,null,null,null,null,null,null,null,null,{"$f":"IFERROR(VLOOKUP(G391,MinimumWages!$A$1:$R$60,MATCH(Employee_Data!H391,MinimumWages!$A$1:$R$1,0),0),0)","v":0},0,{"$f":"ROUND(MAX(ROUNDUP(IF(K391>30000,K391/2,L391/3*2),-2),IFERROR(VLOOKUP(G391,MinimumWages!$A$1:$R$60,(MATCH(Employee_Data!H391,MinimumWages!$A$1:$R$1,0)-4),0),0)),0)","v":0},0,0,0,0,0,0,0,0,0,0,0,0,0,0,0,0,0,"-"]
[391,null,null,null,null,null,null,null,null,null,null,{"$f":"IFERROR(VLOOKUP(G392,MinimumWages!$A$1:$R$60,MATCH(Employee_Data!H392,MinimumWages!$A$1:$R$1,0),0),0)","v":0},0,{"$f":"ROUND(MAX(ROUNDUP(IF(K392>30000,K392/2,L392/3*2),-2),IFERROR(VLOOKUP(G392,MinimumWages!$A$1:$R$60,(MATCH(Employee_Data!H392,MinimumWages!$A$1:$R$1,0)-4),0),0)),0)","v":0},0,0,0,0,0,0,0,0,0,0,0,0,0,0,0,0,0,"-"]
[392,null,null,null,null,null,null,null,null,null,null,{"$f":"IFERROR(VLOOKUP(G393,MinimumWages!$A$1:$R$60,MATCH(Employee_Data!H393,MinimumWages!$A$1:$R$1,0),0),0)","v":0},0,{"$f":"ROUND(MAX(ROUNDUP(IF(K393>30000,K393/2,L393/3*2),-2),IFERROR(VLOOKUP(G393,MinimumWages!$A$1:$R$60,(MATCH(Employee_Data!H393,MinimumWages!$A$1:$R$1,0)-4),0),0)),0)","v":0},0,0,0,0,0,0,0,0,0,0,0,0,0,0,0,0,0,"-"]
[393,null,null,null,null,null,null,null,null,null,null,{"$f":"IFERROR(VLOOKUP(G394,MinimumWages!$A$1:$R$60,MATCH(Employee_Data!H394,MinimumWages!$A$1:$R$1,0),0),0)","v":0},0,{"$f":"ROUND(MAX(ROUNDUP(IF(K394>30000,K394/2,L394/3*2),-2),IFERROR(VLOOKUP(G394,MinimumWages!$A$1:$R$60,(MATCH(Employee_Data!H394,MinimumWages!$A$1:$R$1,0)-4),0),0)),0)","v":0},0,0,0,0,0,0,0,0,0,0,0,0,0,0,0,0,0,"-"]
[394,null,null,null,null,null,null,null,null,null,null,{"$f":"IFERROR(VLOOKUP(G395,MinimumWages!$A$1:$R$60,MATCH(Employee_Data!H395,MinimumWages!$A$1:$R$1,0),0),0)","v":0},0,{"$f":"ROUND(MAX(ROUNDUP(IF(K395>30000,K395/2,L395/3*2),-2),IFERROR(VLOOKUP(G395,MinimumWages!$A$1:$R$60,(MATCH(Employee_Data!H395,MinimumWages!$A$1:$R$1,0)-4),0),0)),0)","v":0},0,0,0,0,0,0,0,0,0,0,0,0,0,0,0,0,0,"-"]
[395,null,null,null,null,null,null,null,null,null,null,{"$f":"IFERROR(VLOOKUP(G396,MinimumWages!$A$1:$R$60,MATCH(Employee_Data!H396,MinimumWages!$A$1:$R$1,0),0),0)","v":0},0,{"$f":"ROUND(MAX(ROUNDUP(IF(K396>30000,K396/2,L396/3*2),-2),IFERROR(VLOOKUP(G396,MinimumWages!$A$1:$R$60,(MATCH(Employee_Data!H396,MinimumWages!$A$1:$R$1,0)-4),0),0)),0)","v":0},0,0,0,0,0,0,0,0,0,0,0,0,0,0,0,0,0,"-"]
[396,null,null,null,null,null,null,null,null,null,null,{"$f":"IFERROR(VLOOKUP(G397,MinimumWages!$A$1:$R$60,MATCH(Employee_Data!H397,MinimumWages!$A$1:$R$1,0),0),0)","v":0},0,{"$f":"ROUND(MAX(ROUNDUP(IF(K397>30000,K397/2,L397/3*2),-2),IFERROR(VLOOKUP(G397,MinimumWages!$A$1:$R$60,(MATCH(Employee_Data!H397,MinimumWages!$A$1:$R$1,0)-4),0),0)),0)","v":0},0,0,0,0,0,0,0,0,0,0,0,0,0,0,0,0,0,"-"]
[397,null,null,null,null,null,null,null,null,null,null,{"$f":"IFERROR(VLOOKUP(G398,MinimumWages!$A$1:$R$60,MATCH(Employee_Data!H398,MinimumWages!$A$1:$R$1,0),0),0)","v":0},0,{"$f":"ROUND(MAX(ROUNDUP(IF(K398>30000,K398/2,L398/3*2),-2),IFERROR(VLOOKUP(G398,MinimumWages!$A$1:$R$60,(MATCH(Employee_Data!H398,MinimumWages!$A$1:$R$1,0)-4),0),0)),0)","v":0},0,0,0,0,0,0,0,0,0,0,0,0,0,0,0,0,0,"-"]
[398,null,null,null,null,null,null,null,null,null,null,{"$f":"IFERROR(VLOOKUP(G399,MinimumWages!$A$1:$R$60,MATCH(Employee_Data!H399,MinimumWages!$A$1:$R$1,0),0),0)","v":0},0,{"$f":"ROUND(MAX(ROUNDUP(IF(K399>30000,K399/2,L399/3*2),-2),IFERROR(VLOOKUP(G399,MinimumWages!$A$1:$R$60,(MATCH(Employee_Data!H399,MinimumWages!$A$1:$R$1,0)-4),0),0)),0)","v":0},0,0,0,0,0,0,0,0,0,0,0,0,0,0,0,0,0,"-"]
[399,null,null,null,null,null,null,null,null,null,null,{"$f":"IFERROR(VLOOKUP(G400,MinimumWages!$A$1:$R$60,MATCH(Employee_Data!H400,MinimumWages!$A$1:$R$1,0),0),0)","v":0},0,{"$f":"ROUND(MAX(ROUNDUP(IF(K400>30000,K400/2,L400/3*2),-2),IFERROR(VLOOKUP(G400,MinimumWages!$A$1:$R$60,(MATCH(Employee_Data!H400,MinimumWages!$A$1:$R$1,0)-4),0),0)),0)","v":0},0,0,0,0,0,0,0,0,0,0,0,0,0,0,0,0,0,"-"]
[400,null,null,null,null,null,null,null,null,null,null,{"$f":"IFERROR(VLOOKUP(G401,MinimumWages!$A$1:$R$60,MATCH(Employee_Data!H401,MinimumWages!$A$1:$R$1,0),0),0)","v":0},0,{"$f":"ROUND(MAX(ROUNDUP(IF(K401>30000,K401/2,L401/3*2),-2),IFERROR(VLOOKUP(G401,MinimumWages!$A$1:$R$60,(MATCH(Employee_Data!H401,MinimumWages!$A$1:$R$1,0)-4),0),0)),0)","v":0},0,0,0,0,0,0,0,0,0,0,0,0,0,0,0,0,0,"-"]
[401,null,null,null,null,null,null,null,null,null,null,{"$f":"IFERROR(VLOOKUP(G402,MinimumWages!$A$1:$R$60,MATCH(Employee_Data!H402,MinimumWages!$A$1:$R$1,0),0),0)","v":0},0,{"$f":"ROUND(MAX(ROUNDUP(IF(K402>30000,K402/2,L402/3*2),-2),IFERROR(VLOOKUP(G402,MinimumWages!$A$1:$R$60,(MATCH(Employee_Data!H402,MinimumWages!$A$1:$R$1,0)-4),0),0)),0)","v":0},0,0,0,0,0,0,0,0,0,0,0,0,0,0,0,0,0,"-"]
[402,null,null,null,null,null,null,null,null,null,null,{"$f":"IFERROR(VLOOKUP(G403,MinimumWages!$A$1:$R$60,MATCH(Employee_Data!H403,MinimumWages!$A$1:$R$1,0),0),0)","v":0},0,{"$f":"ROUND(MAX(ROUNDUP(IF(K403>30000,K403/2,L403/3*2),-2),IFERROR(VLOOKUP(G403,MinimumWages!$A$1:$R$60,(MATCH(Employee_Data!H403,MinimumWages!$A$1:$R$1,0)-4),0),0)),0)","v":0},0,0,0,0,0,0,0,0,0,0,0,0,0,0,0,0,0,"-"]
[403,null,null,null,null,null,null,null,null,null,null,{"$f":"IFERROR(VLOOKUP(G404,MinimumWages!$A$1:$R$60,MATCH(Employee_Data!H404,MinimumWages!$A$1:$R$1,0),0),0)","v":0},0,{"$f":"ROUND(MAX(ROUNDUP(IF(K404>30000,K404/2,L404/3*2),-2),IFERROR(VLOOKUP(G404,MinimumWages!$A$1:$R$60,(MATCH(Employee_Data!H404,MinimumWages!$A$1:$R$1,0)-4),0),0)),0)","v":0},0,0,0,0,0,0,0,0,0,0,0,0,0,0,0,0,0,"-"]
[404,null,null,null,null,null,null,null,null,null,null,{"$f":"IFERROR(VLOOKUP(G405,MinimumWages!$A$1:$R$60,MATCH(Employee_Data!H405,MinimumWages!$A$1:$R$1,0),0),0)","v":0},0,{"$f":"ROUND(MAX(ROUNDUP(IF(K405>30000,K405/2,L405/3*2),-2),IFERROR(VLOOKUP(G405,MinimumWages!$A$1:$R$60,(MATCH(Employee_Data!H405,MinimumWages!$A$1:$R$1,0)-4),0),0)),0)","v":0},0,0,0,0,0,0,0,0,0,0,0,0,0,0,0,0,0,"-"]
[405,null,null,null,null,null,null,null,null,null,null,{"$f":"IFERROR(VLOOKUP(G406,MinimumWages!$A$1:$R$60,MATCH(Employee_Data!H406,MinimumWages!$A$1:$R$1,0),0),0)","v":0},0,{"$f":"ROUND(MAX(ROUNDUP(IF(K406>30000,K406/2,L406/3*2),-2),IFERROR(VLOOKUP(G406,MinimumWages!$A$1:$R$60,(MATCH(Employee_Data!H406,MinimumWages!$A$1:$R$1,0)-4),0),0)),0)","v":0},0,0,0,0,0,0,0,0,0,0,0,0,0,0,0,0,0,"-"]
[406,null,null,null,null,null,null,null,null,null,null,{"$f":"IFERROR(VLOOKUP(G407,MinimumWages!$A$1:$R$60,MATCH(Employee_Data!H407,MinimumWages!$A$1:$R$1,0),0),0)","v":0},0,{"$f":"ROUND(MAX(ROUNDUP(IF(K407>30000,K407/2,L407/3*2),-2),IFERROR(VLOOKUP(G407,MinimumWages!$A$1:$R$60,(MATCH(Employee_Data!H407,MinimumWages!$A$1:$R$1,0)-4),0),0)),0)","v":0},0,0,0,0,0,0,0,0,0,0,0,0,0,0,0,0,0,"-"]
[407,null,null,null,null,null,null,null,null,null,null,{"$f":"IFERROR(VLOOKUP(G408,MinimumWages!$A$1:$R$60,MATCH(Employee_Data!H408,MinimumWages!$A$1:$R$1,0),0),0)","v":0},0,{"$f":"ROUND(MAX(ROUNDUP(IF(K408>30000,K408/2,L408/3*2),-2),IFERROR(VLOOKUP(G408,MinimumWages!$A$1:$R$60,(MATCH(Employee_Data!H408,MinimumWages!$A$1:$R$1,0)-4),0),0)),0)","v":0},0,0,0,0,0,0,0,0,0,0,0,0,0,0,0,0,0,"-"]
[408,null,null,null,null,null,null,null,null,null,null,{"$f":"IFERROR(VLOOKUP(G409,MinimumWages!$A$1:$R$60,MATCH(Employee_Data!H409,MinimumWages!$A$1:$R$1,0),0),0)","v":0},0,{"$f":"ROUND(MAX(ROUNDUP(IF(K409>30000,K409/2,L409/3*2),-2),IFERROR(VLOOKUP(G409,MinimumWages!$A$1:$R$60,(MATCH(Employee_Data!H409,MinimumWages!$A$1:$R$1,0)-4),0),0)),0)","v":0},0,0,0,0,0,0,0,0,0,0,0,0,0,0,0,0,0,"-"]
[409,null,null,null,null,null,null,null,null,null,null,{"$f":"IFERROR(VLOOKUP(G410,MinimumWages!$A$1:$R$60,MATCH(Employee_Data!H410,MinimumWages!$A$1:$R$1,0),0),0)","v":0},0,{"$f":"ROUND(MAX(ROUNDUP(IF(K410>30000,K410/2,L410/3*2),-2),IFERROR(VLOOKUP(G410,MinimumWages!$A$1:$R$60,(MATCH(Employee_Data!H410,MinimumWages!$A$1:$R$1,0)-4),0),0)),0)","v":0},0,0,0,0,0,0,0,0,0,0,0,0,0,0,0,0,0,"-"]
[410,null,null,null,null,null,null,null,null,null,null,{"$f":"IFERROR(VLOOKUP(G411,MinimumWages!$A$1:$R$60,MATCH(Employee_Data!H411,MinimumWages!$A$1:$R$1,0),0),0)","v":0},0,{"$f":"ROUND(MAX(ROUNDUP(IF(K411>30000,K411/2,L411/3*2),-2),IFERROR(VLOOKUP(G411,MinimumWages!$A$1:$R$60,(MATCH(Employee_Data!H411,MinimumWages!$A$1:$R$1,0)-4),0),0)),0)","v":0},0,0,0,0,0,0,0,0,0,0,0,0,0,0,0,0,0,"-"]
[411,null,null,null,null,null,null,null,null,null,null,{"$f":"IFERROR(VLOOKUP(G412,MinimumWages!$A$1:$R$60,MATCH(Employee_Data!H412,MinimumWages!$A$1:$R$1,0),0),0)","v":0},0,{"$f":"ROUND(MAX(ROUNDUP(IF(K412>30000,K412/2,L412/3*2),-2),IFERROR(VLOOKUP(G412,MinimumWages!$A$1:$R$60,(MATCH(Employee_Data!H412,MinimumWages!$A$1:$R$1,0)-4),0),0)),0)","v":0},0,0,0,0,0,0,0,0,0,0,0,0,0,0,0,0,0,"-"]
[412,null,null,null,null,null,null,null,null,null,null,{"$f":"IFERROR(VLOOKUP(G413,MinimumWages!$A$1:$R$60,MATCH(Employee_Data!H413,MinimumWages!$A$1:$R$1,0),0),0)","v":0},0,{"$f":"ROUND(MAX(ROUNDUP(IF(K413>30000,K413/2,L413/3*2),-2),IFERROR(VLOOKUP(G413,MinimumWages!$A$1:$R$60,(MATCH(Employee_Data!H413,MinimumWages!$A$1:$R$1,0)-4),0),0)),0)","v":0},0,0,0,0,0,0,0,0,0,0,0,0,0,0,0,0,0,"-"]
[413,null,null,null,null,null,null,null,null,null,null,{"$f":"IFERROR(VLOOKUP(G414,MinimumWages!$A$1:$R$60,MATCH(Employee_Data!H414,MinimumWages!$A$1:$R$1,0),0),0)","v":0},0,{"$f":"ROUND(MAX(ROUNDUP(IF(K414>30000,K414/2,L414/3*2),-2),IFERROR(VLOOKUP(G414,MinimumWages!$A$1:$R$60,(MATCH(Employee_Data!H414,MinimumWages!$A$1:$R$1,0)-4),0),0)),0)","v":0},0,0,0,0,0,0,0,0,0,0,0,0,0,0,0,0,0,"-"]
[414,null,null,null,null,null,null,null,null,null,null,{"$f":"IFERROR(VLOOKUP(G415,MinimumWages!$A$1:$R$60,MATCH(Employee_Data!H415,MinimumWages!$A$1:$R$1,0),0),0)","v":0},{"$f":"ROUND(K415*12,0)","v":0},{"$f":"ROUND(MAX(ROUNDUP(IF(K415>30000,K415/2,L415/3*2),-2),IFERROR(VLOOKUP(G415,MinimumWages!$A$1:$R$60,(MATCH(Employee_Data!H415,MinimumWages!$A$1:$R$1,0)-4),0),0)),0)","v":0},{"$f":"ROUND(IF(K415<30000,N415*5%,N415/2),0)","v":0},0,0,0,0,0,0,{"$f":"SUM(N415:U415)","v":0},{"$f":"IF(I415=\"Yes\",ROUND(IF(J415=\"Limit\",MIN((V415-O415),15000),IF(N415>15000,N415,MIN((V415-O415),15000)))*12%,0),0)","v":0},{"$f":"IF(V415>21000,0,ROUNDUP(V415*3.75%,0))","v":0},{"$f":"SUM(V415:X415)","v":0},{"$f":"IF(AND(N415<=21000,K415>0),ROUND(MAX(L415,7000)*8.33%,0),0)","v":0},{"$f":"ROUND(N415/26*15/12,0)","v":0},0,{"$f":"SUM(Y415:AB415)","v":0},0,{"$f":"ROUND((M415-AD415)/12,0)","v":0},{"$f":"IF(AE415<>0,\"Un-Matched CTC\",IF(COUNTIF(N415:AE415,\"<0\")>0,\"Less CTC\",\"-\"))","v":"-"}]
[415,null,null,null,null,null,null,null,null,null,null,{"$f":"IFERROR(VLOOKUP(G416,MinimumWages!$A$1:$R$60,MATCH(Employee_Data!H416,MinimumWages!$A$1:$R$1,0),0),0)","v":0},0,{"$f":"ROUND(MAX(ROUNDUP(IF(K416>30000,K416/2,L416/3*2),-2),IFERROR(VLOOKUP(G416,MinimumWages!$A$1:$R$60,(MATCH(Employee_Data!H416,MinimumWages!$A$1:$R$1,0)-4),0),0)),0)","v":0},0,0,0,0,0,0,0,0,0,0,0,0,0,0,0,0,0,"-"]
[416,null,null,null,null,null,null,null,null,null,null,{"$f":"IFERROR(VLOOKUP(G417,MinimumWages!$A$1:$R$60,MATCH(Employee_Data!H417,MinimumWages!$A$1:$R$1,0),0),0)","v":0},0,{"$f":"ROUND(MAX(ROUNDUP(IF(K417>30000,K417/2,L417/3*2),-2),IFERROR(VLOOKUP(G417,MinimumWages!$A$1:$R$60,(MATCH(Employee_Data!H417,MinimumWages!$A$1:$R$1,0)-4),0),0)),0)","v":0},0,0,0,0,0,0,0,0,0,0,0,0,0,0,0,0,0,"-"]
[417,null,null,null,null,null,null,null,null,null,null,{"$f":"IFERROR(VLOOKUP(G418,MinimumWages!$A$1:$R$60,MATCH(Employee_Data!H418,MinimumWages!$A$1:$R$1,0),0),0)","v":0},0,{"$f":"ROUND(MAX(ROUNDUP(IF(K418>30000,K418/2,L418/3*2),-2),IFERROR(VLOOKUP(G418,MinimumWages!$A$1:$R$60,(MATCH(Employee_Data!H418,MinimumWages!$A$1:$R$1,0)-4),0),0)),0)","v":0},0,0,0,0,0,0,0,0,0,0,0,0,0,0,0,0,0,"-"]
[418,null,null,null,null,null,null,null,null,null,null,{"$f":"IFERROR(VLOOKUP(G419,MinimumWages!$A$1:$R$60,MATCH(Employee_Data!H419,MinimumWages!$A$1:$R$1,0),0),0)","v":0},0,{"$f":"ROUND(MAX(ROUNDUP(IF(K419>30000,K419/2,L419/3*2),-2),IFERROR(VLOOKUP(G419,MinimumWages!$A$1:$R$60,(MATCH(Employee_Data!H419,MinimumWages!$A$1:$R$1,0)-4),0),0)),0)","v":0},0,0,0,0,0,0,0,0,0,0,0,0,0,0,0,0,0,"-"]
[419,null,null,null,null,null,null,null,null,null,null,{"$f":"IFERROR(VLOOKUP(G420,MinimumWages!$A$1:$R$60,MATCH(Employee_Data!H420,MinimumWages!$A$1:$R$1,0),0),0)","v":0},0,{"$f":"ROUND(MAX(ROUNDUP(IF(K420>30000,K420/2,L420/3*2),-2),IFERROR(VLOOKUP(G420,MinimumWages!$A$1:$R$60,(MATCH(Employee_Data!H420,MinimumWages!$A$1:$R$1,0)-4),0),0)),0)","v":0},0,0,0,0,0,0,0,0,0,0,0,0,0,0,0,0,0,"-"]
[420,null,null,null,null,null,null,null,null,null,null,{"$f":"IFERROR(VLOOKUP(G421,MinimumWages!$A$1:$R$60,MATCH(Employee_Data!H421,MinimumWages!$A$1:$R$1,0),0),0)","v":0},0,{"$f":"ROUND(MAX(ROUNDUP(IF(K421>30000,K421/2,L421/3*2),-2),IFERROR(VLOOKUP(G421,MinimumWages!$A$1:$R$60,(MATCH(Employee_Data!H421,MinimumWages!$A$1:$R$1,0)-4),0),0)),0)","v":0},0,0,0,0,0,0,0,0,0,0,0,0,0,0,0,0,0,"-"]
[421,null,null,null,null,null,null,null,null,null,null,{"$f":"IFERROR(VLOOKUP(G422,MinimumWages!$A$1:$R$60,MATCH(Employee_Data!H422,MinimumWages!$A$1:$R$1,0),0),0)","v":0},0,{"$f":"ROUND(MAX(ROUNDUP(IF(K422>30000,K422/2,L422/3*2),-2),IFERROR(VLOOKUP(G422,MinimumWages!$A$1:$R$60,(MATCH(Employee_Data!H422,MinimumWages!$A$1:$R$1,0)-4),0),0)),0)","v":0},0,0,0,0,0,0,0,0,0,0,0,0,0,0,0,0,0,"-"]
[422,null,null,null,null,null,null,null,null,null,null,{"$f":"IFERROR(VLOOKUP(G423,MinimumWages!$A$1:$R$60,MATCH(Employee_Data!H423,MinimumWages!$A$1:$R$1,0),0),0)","v":0},0,{"$f":"ROUND(MAX(ROUNDUP(IF(K423>30000,K423/2,L423/3*2),-2),IFERROR(VLOOKUP(G423,MinimumWages!$A$1:$R$60,(MATCH(Employee_Data!H423,MinimumWages!$A$1:$R$1,0)-4),0),0)),0)","v":0},0,0,0,0,0,0,0,0,0,0,0,0,0,0,0,0,0,"-"]
[423,null,null,null,null,null,null,null,null,null,null,{"$f":"IFERROR(VLOOKUP(G424,MinimumWages!$A$1:$R$60,MATCH(Employee_Data!H424,MinimumWages!$A$1:$R$1,0),0),0)","v":0},0,{"$f":"ROUND(MAX(ROUNDUP(IF(K424>30000,K424/2,L424/3*2),-2),IFERROR(VLOOKUP(G424,MinimumWages!$A$1:$R$60,(MATCH(Employee_Data!H424,MinimumWages!$A$1:$R$1,0)-4),0),0)),0)","v":0},0,0,0,0,0,0,0,0,0,0,0,0,0,0,0,0,0,"-"]
[424,null,null,null,null,null,null,null,null,null,null,{"$f":"IFERROR(VLOOKUP(G425,MinimumWages!$A$1:$R$60,MATCH(Employee_Data!H425,MinimumWages!$A$1:$R$1,0),0),0)","v":0},0,{"$f":"ROUND(MAX(ROUNDUP(IF(K425>30000,K425/2,L425/3*2),-2),IFERROR(VLOOKUP(G425,MinimumWages!$A$1:$R$60,(MATCH(Employee_Data!H425,MinimumWages!$A$1:$R$1,0)-4),0),0)),0)","v":0},0,0,0,0,0,0,0,0,0,0,0,0,0,0,0,0,0,"-"]
[425,null,null,null,null,null,null,null,null,null,null,{"$f":"IFERROR(VLOOKUP(G426,MinimumWages!$A$1:$R$60,MATCH(Employee_Data!H426,MinimumWages!$A$1:$R$1,0),0),0)","v":0},0,{"$f":"ROUND(MAX(ROUNDUP(IF(K426>30000,K426/2,L426/3*2),-2),IFERROR(VLOOKUP(G426,MinimumWages!$A$1:$R$60,(MATCH(Employee_Data!H426,MinimumWages!$A$1:$R$1,0)-4),0),0)),0)","v":0},0,0,0,0,0,0,0,0,0,0,0,0,0,0,0,0,0,"-"]
[426,null,null,null,null,null,null,null,null,null,null,{"$f":"IFERROR(VLOOKUP(G427,MinimumWages!$A$1:$R$60,MATCH(Employee_Data!H427,MinimumWages!$A$1:$R$1,0),0),0)","v":0},0,{"$f":"ROUND(MAX(ROUNDUP(IF(K427>30000,K427/2,L427/3*2),-2),IFERROR(VLOOKUP(G427,MinimumWages!$A$1:$R$60,(MATCH(Employee_Data!H427,MinimumWages!$A$1:$R$1,0)-4),0),0)),0)","v":0},0,0,0,0,0,0,0,0,0,0,0,0,0,0,0,0,0,"-"]
[427,null,null,null,null,null,null,null,null,null,null,{"$f":"IFERROR(VLOOKUP(G428,MinimumWages!$A$1:$R$60,MATCH(Employee_Data!H428,MinimumWages!$A$1:$R$1,0),0),0)","v":0},0,{"$f":"ROUND(MAX(ROUNDUP(IF(K428>30000,K428/2,L428/3*2),-2),IFERROR(VLOOKUP(G428,MinimumWages!$A$1:$R$60,(MATCH(Employee_Data!H428,MinimumWages!$A$1:$R$1,0)-4),0),0)),0)","v":0},0,0,0,0,0,0,0,0,0,0,0,0,0,0,0,0,0,"-"]
[428,null,null,null,null,null,null,null,null,null,null,{"$f":"IFERROR(VLOOKUP(G429,MinimumWages!$A$1:$R$60,MATCH(Employee_Data!H429,MinimumWages!$A$1:$R$1,0),0),0)","v":0},0,{"$f":"ROUND(MAX(ROUNDUP(IF(K429>30000,K429/2,L429/3*2),-2),IFERROR(VLOOKUP(G429,MinimumWages!$A$1:$R$60,(MATCH(Employee_Data!H429,MinimumWages!$A$1:$R$1,0)-4),0),0)),0)","v":0},0,0,0,0,0,0,0,0,0,0,0,0,0,0,0,0,0,"-"]
[429,null,null,null,null,null,null,null,null,null,null,{"$f":"IFERROR(VLOOKUP(G430,MinimumWages!$A$1:$R$60,MATCH(Employee_Data!H430,MinimumWages!$A$1:$R$1,0),0),0)","v":0},0,{"$f":"ROUND(MAX(ROUNDUP(IF(K430>30000,K430/2,L430/3*2),-2),IFERROR(VLOOKUP(G430,MinimumWages!$A$1:$R$60,(MATCH(Employee_Data!H430,MinimumWages!$A$1:$R$1,0)-4),0),0)),0)","v":0},0,0,0,0,0,0,0,0,0,0,0,0,0,0,0,0,0,"-"]
[430,null,null,null,null,null,null,null,null,null,null,{"$f":"IFERROR(VLOOKUP(G431,MinimumWages!$A$1:$R$60,MATCH(Employee_Data!H431,MinimumWages!$A$1:$R$1,0),0),0)","v":0},0,{"$f":"ROUND(MAX(ROUNDUP(IF(K431>30000,K431/2,L431/3*2),-2),IFERROR(VLOOKUP(G431,MinimumWages!$A$1:$R$60,(MATCH(Employee_Data!H431,MinimumWages!$A$1:$R$1,0)-4),0),0)),0)","v":0},0,0,0,0,0,0,0,0,0,0,0,0,0,0,0,0,0,"-"]
[431,null,null,null,null,null,null,null,null,null,null,{"$f":"IFERROR(VLOOKUP(G432,MinimumWages!$A$1:$R$60,MATCH(Employee_Data!H432,MinimumWages!$A$1:$R$1,0),0),0)","v":0},0,{"$f":"ROUND(MAX(ROUNDUP(IF(K432>30000,K432/2,L432/3*2),-2),IFERROR(VLOOKUP(G432,MinimumWages!$A$1:$R$60,(MATCH(Employee_Data!H432,MinimumWages!$A$1:$R$1,0)-4),0),0)),0)","v":0},0,0,0,0,0,0,0,0,0,0,0,0,0,0,0,0,0,"-"]
[432,null,null,null,null,null,null,null,null,null,null,{"$f":"IFERROR(VLOOKUP(G433,MinimumWages!$A$1:$R$60,MATCH(Employee_Data!H433,MinimumWages!$A$1:$R$1,0),0),0)","v":0},0,{"$f":"ROUND(MAX(ROUNDUP(IF(K433>30000,K433/2,L433/3*2),-2),IFERROR(VLOOKUP(G433,MinimumWages!$A$1:$R$60,(MATCH(Employee_Data!H433,MinimumWages!$A$1:$R$1,0)-4),0),0)),0)","v":0},0,0,0,0,0,0,0,0,0,0,0,0,0,0,0,0,0,"-"]
[433,null,null,null,null,null,null,null,null,null,null,{"$f":"IFERROR(VLOOKUP(G434,MinimumWages!$A$1:$R$60,MATCH(Employee_Data!H434,MinimumWages!$A$1:$R$1,0),0),0)","v":0},0,{"$f":"ROUND(MAX(ROUNDUP(IF(K434>30000,K434/2,L434/3*2),-2),IFERROR(VLOOKUP(G434,MinimumWages!$A$1:$R$60,(MATCH(Employee_Data!H434,MinimumWages!$A$1:$R$1,0)-4),0),0)),0)","v":0},0,0,0,0,0,0,0,0,0,0,0,0,0,0,0,0,0,"-"]
[434,null,null,null,null,null,null,null,null,null,null,{"$f":"IFERROR(VLOOKUP(G435,MinimumWages!$A$1:$R$60,MATCH(Employee_Data!H435,MinimumWages!$A$1:$R$1,0),0),0)","v":0},0,{"$f":"ROUND(MAX(ROUNDUP(IF(K435>30000,K435/2,L435/3*2),-2),IFERROR(VLOOKUP(G435,MinimumWages!$A$1:$R$60,(MATCH(Employee_Data!H435,MinimumWages!$A$1:$R$1,0)-4),0),0)),0)","v":0},0,0,0,0,0,0,0,0,0,0,0,0,0,0,0,0,0,"-"]
[435,null,null,null,null,null,null,null,null,null,null,{"$f":"IFERROR(VLOOKUP(G436,MinimumWages!$A$1:$R$60,MATCH(Employee_Data!H436,MinimumWages!$A$1:$R$1,0),0),0)","v":0},0,{"$f":"ROUND(MAX(ROUNDUP(IF(K436>30000,K436/2,L436/3*2),-2),IFERROR(VLOOKUP(G436,MinimumWages!$A$1:$R$60,(MATCH(Employee_Data!H436,MinimumWages!$A$1:$R$1,0)-4),0),0)),0)","v":0},0,0,0,0,0,0,0,0,0,0,0,0,0,0,0,0,0,"-"]
[436,null,null,null,null,null,null,null,null,null,null,{"$f":"IFERROR(VLOOKUP(G437,MinimumWages!$A$1:$R$60,MATCH(Employee_Data!H437,MinimumWages!$A$1:$R$1,0),0),0)","v":0},0,{"$f":"ROUND(MAX(ROUNDUP(IF(K437>30000,K437/2,L437/3*2),-2),IFERROR(VLOOKUP(G437,MinimumWages!$A$1:$R$60,(MATCH(Employee_Data!H437,MinimumWages!$A$1:$R$1,0)-4),0),0)),0)","v":0},0,0,0,0,0,0,0,0,0,0,0,0,0,0,0,0,0,"-"]
[437,null,null,null,null,null,null,null,null,null,null,{"$f":"IFERROR(VLOOKUP(G438,MinimumWages!$A$1:$R$60,MATCH(Employee_Data!H438,MinimumWages!$A$1:$R$1,0),0),0)","v":0},0,{"$f":"ROUND(MAX(ROUNDUP(IF(K438>30000,K438/2,L438/3*2),-2),IFERROR(VLOOKUP(G438,MinimumWages!$A$1:$R$60,(MATCH(Employee_Data!H438,MinimumWages!$A$1:$R$1,0)-4),0),0)),0)","v":0},0,0,0,0,0,0,0,0,0,0,0,0,0,0,0,0,0,"-"]
[438,null,null,null,null,null,null,null,null,null,null,{"$f":"IFERROR(VLOOKUP(G439,MinimumWages!$A$1:$R$60,MATCH(Employee_Data!H439,MinimumWages!$A$1:$R$1,0),0),0)","v":0},0,{"$f":"ROUND(MAX(ROUNDUP(IF(K439>30000,K439/2,L439/3*2),-2),IFERROR(VLOOKUP(G439,MinimumWages!$A$1:$R$60,(MATCH(Employee_Data!H439,MinimumWages!$A$1:$R$1,0)-4),0),0)),0)","v":0},0,0,0,0,0,0,0,0,0,0,0,0,0,0,0,0,0,"-"]
[439,null,null,null,null,null,null,null,null,null,null,{"$f":"IFERROR(VLOOKUP(G440,MinimumWages!$A$1:$R$60,MATCH(Employee_Data!H440,MinimumWages!$A$1:$R$1,0),0),0)","v":0},0,{"$f":"ROUND(MAX(ROUNDUP(IF(K440>30000,K440/2,L440/3*2),-2),IFERROR(VLOOKUP(G440,MinimumWages!$A$1:$R$60,(MATCH(Employee_Data!H440,MinimumWages!$A$1:$R$1,0)-4),0),0)),0)","v":0},0,0,0,0,0,0,0,0,0,0,0,0,0,0,0,0,0,"-"]
[440,null,null,null,null,null,null,null,null,null,null,{"$f":"IFERROR(VLOOKUP(G441,MinimumWages!$A$1:$R$60,MATCH(Employee_Data!H441,MinimumWages!$A$1:$R$1,0),0),0)","v":0},0,{"$f":"ROUND(MAX(ROUNDUP(IF(K441>30000,K441/2,L441/3*2),-2),IFERROR(VLOOKUP(G441,MinimumWages!$A$1:$R$60,(MATCH(Employee_Data!H441,MinimumWages!$A$1:$R$1,0)-4),0),0)),0)","v":0},0,0,0,0,0,0,0,0,0,0,0,0,0,0,0,0,0,"-"]
[441,null,null,null,null,null,null,null,null,null,null,{"$f":"IFERROR(VLOOKUP(G442,MinimumWages!$A$1:$R$60,MATCH(Employee_Data!H442,MinimumWages!$A$1:$R$1,0),0),0)","v":0},0,{"$f":"ROUND(MAX(ROUNDUP(IF(K442>30000,K442/2,L442/3*2),-2),IFERROR(VLOOKUP(G442,MinimumWages!$A$1:$R$60,(MATCH(Employee_Data!H442,MinimumWages!$A$1:$R$1,0)-4),0),0)),0)","v":0},0,0,0,0,0,0,0,0,0,0,0,0,0,0,0,0,0,"-"]
[442,null,null,null,null,null,null,null,null,null,null,{"$f":"IFERROR(VLOOKUP(G443,MinimumWages!$A$1:$R$60,MATCH(Employee_Data!H443,MinimumWages!$A$1:$R$1,0),0),0)","v":0},0,{"$f":"ROUND(MAX(ROUNDUP(IF(K443>30000,K443/2,L443/3*2),-2),IFERROR(VLOOKUP(G443,MinimumWages!$A$1:$R$60,(MATCH(Employee_Data!H443,MinimumWages!$A$1:$R$1,0)-4),0),0)),0)","v":0},0,0,0,0,0,0,0,0,0,0,0,0,0,0,0,0,0,"-"]
[443,null,null,null,null,null,null,null,null,null,null,{"$f":"IFERROR(VLOOKUP(G444,MinimumWages!$A$1:$R$60,MATCH(Employee_Data!H444,MinimumWages!$A$1:$R$1,0),0),0)","v":0},0,{"$f":"ROUND(MAX(ROUNDUP(IF(K444>30000,K444/2,L444/3*2),-2),IFERROR(VLOOKUP(G444,MinimumWages!$A$1:$R$60,(MATCH(Employee_Data!H444,MinimumWages!$A$1:$R$1,0)-4),0),0)),0)","v":0},0,0,0,0,0,0,0,0,0,0,0,0,0,0,0,0,0,"-"]
[444,null,null,null,null,null,null,null,null,null,null,{"$f":"IFERROR(VLOOKUP(G445,MinimumWages!$A$1:$R$60,MATCH(Employee_Data!H445,MinimumWages!$A$1:$R$1,0),0),0)","v":0},0,{"$f":"ROUND(MAX(ROUNDUP(IF(K445>30000,K445/2,L445/3*2),-2),IFERROR(VLOOKUP(G445,MinimumWages!$A$1:$R$60,(MATCH(Employee_Data!H445,MinimumWages!$A$1:$R$1,0)-4),0),0)),0)","v":0},0,0,0,0,0,0,0,0,0,0,0,0,0,0,0,0,0,"-"]
[445,null,null,null,null,null,null,null,null,null,null,{"$f":"IFERROR(VLOOKUP(G446,MinimumWages!$A$1:$R$60,MATCH(Employee_Data!H446,MinimumWages!$A$1:$R$1,0),0),0)","v":0},0,{"$f":"ROUND(MAX(ROUNDUP(IF(K446>30000,K446/2,L446/3*2),-2),IFERROR(VLOOKUP(G446,MinimumWages!$A$1:$R$60,(MATCH(Employee_Data!H446,MinimumWages!$A$1:$R$1,0)-4),0),0)),0)","v":0},0,0,0,0,0,0,0,0,0,0,0,0,0,0,0,0,0,"-"]
[446,null,null,null,null,null,null,null,null,null,null,{"$f":"IFERROR(VLOOKUP(G447,MinimumWages!$A$1:$R$60,MATCH(Employee_Data!H447,MinimumWages!$A$1:$R$1,0),0),0)","v":0},0,{"$f":"ROUND(MAX(ROUNDUP(IF(K447>30000,K447/2,L447/3*2),-2),IFERROR(VLOOKUP(G447,MinimumWages!$A$1:$R$60,(MATCH(Employee_Data!H447,MinimumWages!$A$1:$R$1,0)-4),0),0)),0)","v":0},0,0,0,0,0,0,0,0,0,0,0,0,0,0,0,0,0,"-"]
[447,null,null,null,null,null,null,null,null,null,null,{"$f":"IFERROR(VLOOKUP(G448,MinimumWages!$A$1:$R$60,MATCH(Employee_Data!H448,MinimumWages!$A$1:$R$1,0),0),0)","v":0},0,{"$f":"ROUND(MAX(ROUNDUP(IF(K448>30000,K448/2,L448/3*2),-2),IFERROR(VLOOKUP(G448,MinimumWages!$A$1:$R$60,(MATCH(Employee_Data!H448,MinimumWages!$A$1:$R$1,0)-4),0),0)),0)","v":0},0,0,0,0,0,0,0,0,0,0,0,0,0,0,0,0,0,"-"]
[448,null,null,null,null,null,null,null,null,null,null,{"$f":"IFERROR(VLOOKUP(G449,MinimumWages!$A$1:$R$60,MATCH(Employee_Data!H449,MinimumWages!$A$1:$R$1,0),0),0)","v":0},0,{"$f":"ROUND(MAX(ROUNDUP(IF(K449>30000,K449/2,L449/3*2),-2),IFERROR(VLOOKUP(G449,MinimumWages!$A$1:$R$60,(MATCH(Employee_Data!H449,MinimumWages!$A$1:$R$1,0)-4),0),0)),0)","v":0},0,0,0,0,0,0,0,0,0,0,0,0,0,0,0,0,0,"-"]
[449,null,null,null,null,null,null,null,null,null,null,{"$f":"IFERROR(VLOOKUP(G450,MinimumWages!$A$1:$R$60,MATCH(Employee_Data!H450,MinimumWages!$A$1:$R$1,0),0),0)","v":0},0,{"$f":"ROUND(MAX(ROUNDUP(IF(K450>30000,K450/2,L450/3*2),-2),IFERROR(VLOOKUP(G450,MinimumWages!$A$1:$R$60,(MATCH(Employee_Data!H450,MinimumWages!$A$1:$R$1,0)-4),0),0)),0)","v":0},0,0,0,0,0,0,0,0,0,0,0,0,0,0,0,0,0,"-"]
[{"$f":"ROW()-1","v":450},null,null,null,null,null,null,null,null,null,null,{"$f":"IFERROR(VLOOKUP(G451,MinimumWages!$A$1:$R$60,MATCH(Employee_Data!H451,MinimumWages!$A$1:$R$1,0),0),0)","v":0},0,{"$f":"ROUND(MAX(ROUNDUP(IF(K451>30000,K451/2,L451/3*2),-2),IFERROR(VLOOKUP(G451,MinimumWages!$A$1:$R$60,(MATCH(Employee_Data!H451,MinimumWages!$A$1:$R$1,0)-4),0),0)),0)","v":0},0,0,0,0,0,0,0,0,0,0,0,0,0,0,0,{"$f":"ROUND(AC451*12,0)","v":0},0,"-"]
[451,null,null,null,null,null,null,null,null,null,null,{"$f":"IFERROR(VLOOKUP(G452,MinimumWages!$A$1:$R$60,MATCH(Employee_Data!H452,MinimumWages!$A$1:$R$1,0),0),0)","v":0},0,{"$f":"ROUND(MAX(ROUNDUP(IF(K452>30000,K452/2,L452/3*2),-2),IFERROR(VLOOKUP(G452,MinimumWages!$A$1:$R$60,(MATCH(Employee_Data!H452,MinimumWages!$A$1:$R$1,0)-4),0),0)),0)","v":0},0,0,0,0,0,0,0,0,0,0,0,0,0,0,0,0,0,"-"]
[452,null,null,null,null,null,null,null,null,null,null,{"$f":"IFERROR(VLOOKUP(G453,MinimumWages!$A$1:$R$60,MATCH(Employee_Data!H453,MinimumWages!$A$1:$R$1,0),0),0)","v":0},0,{"$f":"ROUND(MAX(ROUNDUP(IF(K453>30000,K453/2,L453/3*2),-2),IFERROR(VLOOKUP(G453,MinimumWages!$A$1:$R$60,(MATCH(Employee_Data!H453,MinimumWages!$A$1:$R$1,0)-4),0),0)),0)","v":0},0,0,0,0,0,0,0,0,0,0,0,0,0,0,0,0,0,"-"]
[453,null,null,null,null,null,null,null,null,null,null,{"$f":"IFERROR(VLOOKUP(G454,MinimumWages!$A$1:$R$60,MATCH(Employee_Data!H454,MinimumWages!$A$1:$R$1,0),0),0)","v":0},0,{"$f":"ROUND(MAX(ROUNDUP(IF(K454>30000,K454/2,L454/3*2),-2),IFERROR(VLOOKUP(G454,MinimumWages!$A$1:$R$60,(MATCH(Employee_Data!H454,MinimumWages!$A$1:$R$1,0)-4),0),0)),0)","v":0},0,0,0,0,0,0,0,0,0,0,0,0,0,0,0,0,0,"-"]
[454,null,null,null,null,null,null,null,null,null,null,{"$f":"IFERROR(VLOOKUP(G455,MinimumWages!$A$1:$R$60,MATCH(Employee_Data!H455,MinimumWages!$A$1:$R$1,0),0),0)","v":0},0,{"$f":"ROUND(MAX(ROUNDUP(IF(K455>30000,K455/2,L455/3*2),-2),IFERROR(VLOOKUP(G455,MinimumWages!$A$1:$R$60,(MATCH(Employee_Data!H455,MinimumWages!$A$1:$R$1,0)-4),0),0)),0)","v":0},0,0,0,0,0,0,0,0,0,0,0,0,0,0,0,0,0,"-"]
[455,null,null,null,null,null,null,null,null,null,null,{"$f":"IFERROR(VLOOKUP(G456,MinimumWages!$A$1:$R$60,MATCH(Employee_Data!H456,MinimumWages!$A$1:$R$1,0),0),0)","v":0},0,{"$f":"ROUND(MAX(ROUNDUP(IF(K456>30000,K456/2,L456/3*2),-2),IFERROR(VLOOKUP(G456,MinimumWages!$A$1:$R$60,(MATCH(Employee_Data!H456,MinimumWages!$A$1:$R$1,0)-4),0),0)),0)","v":0},0,0,0,0,0,0,0,0,0,0,0,0,0,0,0,0,0,"-"]
[456,null,null,null,null,null,null,null,null,null,null,{"$f":"IFERROR(VLOOKUP(G457,MinimumWages!$A$1:$R$60,MATCH(Employee_Data!H457,MinimumWages!$A$1:$R$1,0),0),0)","v":0},0,{"$f":"ROUND(MAX(ROUNDUP(IF(K457>30000,K457/2,L457/3*2),-2),IFERROR(VLOOKUP(G457,MinimumWages!$A$1:$R$60,(MATCH(Employee_Data!H457,MinimumWages!$A$1:$R$1,0)-4),0),0)),0)","v":0},0,0,0,0,0,0,0,0,0,0,0,0,0,0,0,0,0,"-"]
[457,null,null,null,null,null,null,null,null,null,null,{"$f":"IFERROR(VLOOKUP(G458,MinimumWages!$A$1:$R$60,MATCH(Employee_Data!H458,MinimumWages!$A$1:$R$1,0),0),0)","v":0},0,{"$f":"ROUND(MAX(ROUNDUP(IF(K458>30000,K458/2,L458/3*2),-2),IFERROR(VLOOKUP(G458,MinimumWages!$A$1:$R$60,(MATCH(Employee_Data!H458,MinimumWages!$A$1:$R$1,0)-4),0),0)),0)","v":0},0,0,0,0,0,0,0,0,0,0,0,0,0,0,0,0,0,"-"]
[458,null,null,null,null,null,null,null,null,null,null,{"$f":"IFERROR(VLOOKUP(G459,MinimumWages!$A$1:$R$60,MATCH(Employee_Data!H459,MinimumWages!$A$1:$R$1,0),0),0)","v":0},0,{"$f":"ROUND(MAX(ROUNDUP(IF(K459>30000,K459/2,L459/3*2),-2),IFERROR(VLOOKUP(G459,MinimumWages!$A$1:$R$60,(MATCH(Employee_Data!H459,MinimumWages!$A$1:$R$1,0)-4),0),0)),0)","v":0},0,0,0,0,0,0,0,0,0,0,0,0,0,0,0,0,0,"-"]
[459,null,null,null,null,null,null,null,null,null,null,{"$f":"IFERROR(VLOOKUP(G460,MinimumWages!$A$1:$R$60,MATCH(Employee_Data!H460,MinimumWages!$A$1:$R$1,0),0),0)","v":0},0,{"$f":"ROUND(MAX(ROUNDUP(IF(K460>30000,K460/2,L460/3*2),-2),IFERROR(VLOOKUP(G460,MinimumWages!$A$1:$R$60,(MATCH(Employee_Data!H460,MinimumWages!$A$1:$R$1,0)-4),0),0)),0)","v":0},0,0,0,0,0,0,0,0,0,0,0,0,0,0,0,0,0,"-"]
[460,null,null,null,null,null,null,null,null,null,null,{"$f":"IFERROR(VLOOKUP(G461,MinimumWages!$A$1:$R$60,MATCH(Employee_Data!H461,MinimumWages!$A$1:$R$1,0),0),0)","v":0},0,{"$f":"ROUND(MAX(ROUNDUP(IF(K461>30000,K461/2,L461/3*2),-2),IFERROR(VLOOKUP(G461,MinimumWages!$A$1:$R$60,(MATCH(Employee_Data!H461,MinimumWages!$A$1:$R$1,0)-4),0),0)),0)","v":0},0,0,0,0,0,0,0,0,0,0,0,0,0,0,0,0,0,"-"]
[461,null,null,null,null,null,null,null,null,null,null,{"$f":"IFERROR(VLOOKUP(G462,MinimumWages!$A$1:$R$60,MATCH(Employee_Data!H462,MinimumWages!$A$1:$R$1,0),0),0)","v":0},0,{"$f":"ROUND(MAX(ROUNDUP(IF(K462>30000,K462/2,L462/3*2),-2),IFERROR(VLOOKUP(G462,MinimumWages!$A$1:$R$60,(MATCH(Employee_Data!H462,MinimumWages!$A$1:$R$1,0)-4),0),0)),0)","v":0},0,0,0,0,0,0,0,0,0,0,0,0,0,0,0,0,0,"-"]

{"sheet":"MinimumWages","index":2,"n_rows":37,"n_cols":18,"rows_kept":37,"cut":false,"hidden":false,"merged":[]}
["State","Effective From - To","Basic+DA","VDA","HRA","SPLALL","Unskilled","Basic+DA","VDA","HRA","SPLALL","Semi-Skilled","Basic+DA","VDA","HRA","SPLALL","Skilled","Upadted on 03.05.2023"]
["Andhra Pradesh","From 01.04.2023 To 30.09.2023",3700,7379,0,0,{"$f":"SUM(C2:F2)","v":11079},4102,7379,0,0,{"$f":"SUM(H2:K2)","v":11481},4722,7379,0,0,{"$f":"SUM(M2:P2)","v":12101}]
["Andaman","From 01.01.2023 to 30.06.2023",13754,0,0,0,{"$f":"SUM(C3:F3)","v":13754},15236,0,0,0,{"$f":"SUM(H3:K3)","v":15236},17446,0,0,0,{"$f":"SUM(M3:P3)","v":17446}]
["Arunachal Pradesh","From 01.04.2016 to Till Date",6600,0,0,0,6600,6900,0,0,0,6900,7200,0,0,0,7200]
["Assam","From 01.06.2021 to Till Date",7200,1746,0,0,8946,8400,2038,0,0,10438,10500,2548,0,0,13048]
["Bihar","From 01.04.2023 To 30.09.2023",6344,3744,0,0,10088,6630,3848,0,0,10478,8060,4706,0,0,12766]
["Chandigarh","From 01.10.2022 To 31.03.2023",12623,0,0,0,12623,12873,0,0,0,12873,13298,0,0,0,13298]
["Chhattisgarh","From 01.04.2023 To 30.09.2023",8320,2160,0,0,10480,8970,2160,0,0,11130,9750,2160,0,0,11910]
["Dadra & Nagar Haveli","From 01.04.2021 to Till Date",6968,1877,0,0,8845,7176,1877,0,0,9053,7384,1877,0,0,9261]
["Daman and Diu","From 01.04.2020 to Till Date",6968,1469,0,0,8437,7176,1469,0,0,8645,7384,1469,0,0,8853]
["Delhi","From 01.04.2023 To 30.09.2023",16792,442,0,0,17234,18499,494,0,0,18993,20357,546,0,0,20903]
["Goa","From 01.10.2022 To 31.03.2023",8060,2392,0,0,10452,9568,2392,0,0,11960,10998,2392,0,0,13390]
["Gujarat","From 01.04.2023 To 30.09.2023",7176,4576,0,0,11752,7384,4628,0,0,12012,7618,4706,0,0,12324]
["Haryana","From 01.01.2023 to 30-06-2023 ",7600,2933,0,0,10533,8379,3233,0,0,11612,9238,3565,0,0,12803]
["Himachal Pradesh","From 01.04.2022 To 30.09.2022",10500,0,0,0,10500,11098,0,0,0,11098,12191,0,0,0,12191]
["Jammu and Kashmir","From 17.10.2022",8086,0,0,0,8086,10400,0,0,0,10400,12558,0,0,0,12558]
["Jharkhand","From 01.04.2023 To 30.09.2023",7145,1851,0,0,8996,7485,1940,0,0,9425,9867,2557,0,0,12424]
["Karnataka","From 01.04.2023 to 31.03.2024",11588,2837,0,0,14425,12747,2837,0,0,15584,14021,2837,0,0,16858]
["Kerala","From 01.12.2022 to TILL Date",8910,4594,0,0,13504,8910,4594,0,0,13504,9330,4594,0,0,13924]
["Lakshadweep","From 01.01.2016 ",7618,0,0,0,7618,8424,0,0,0,8424,9906,0,0,0,9906]
["Madhya Pradesh","From 01.04.2023 To 30.09.2023",6500,3150,0,0,9650,7057,3450,0,0,10507,8435,3450,0,0,11885]
["Maharashtra","From 01.01.2023 to 30.06.2023",10021,2444,{"$f":"ROUND((C22)*5%,0)","v":501},0,12966,10856,2444,{"$f":"ROUND((H22)*5%,0)","v":543},0,13843,11632,2444,{"$f":"ROUND((M22)*5%,0)","v":582},0,14658]
["Meghalaya","From 01.10.2022 To 31.03.2023",7800,2106,0,0,9906,8840,2392,0,0,11232,9880,2678,0,0,12558]
["Mizoram","From 01.04.2016 to Till Date",7020,0,0,0,7020,7800,0,0,0,7800,9620,0,0,0,9620]
["Nagaland","From 14.06.2019",5280,0,0,0,5280,6300,0,0,0,6300,7050,0,0,0,7050]
["Odisha","From 01.04.2023 To 30.09.2023",7280,1690,0,0,8970,8320,1690,0,0,10010,9620,1690,0,0,11310]
["Pondicherry","From 01.01.2021",7433,233,0,0,7666,7542,233,0,0,7775,7591,233,0,0,7824]
["Punjab","From 01.03.2023 To 31.08.2023",10354,0,0,0,10354,11134,0,0,0,11134,12031,0,0,0,12031]
["Rajasthan","From 01.07.2021",6734,0,0,0,6734,7046,0,0,0,7046,7358,0,0,0,7358]
["Sikkim","From 11.07.2022",13000,0,0,0,13000,13520,0,0,0,13520,13910,0,0,0,13910]
["Tamil Nadu","From 01.04.2022 to 31.03.2023",5457,4698,0,0,10155,5507,4698,0,0,10205,5548,4698,0,0,10246]
["Telangana","From 01.04.2023 To 30.09.2023",4102,7731,0,0,11833,4520,7731,0,0,12251,4722,7731,0,0,12453]
["Tripura","From 01.10.2022 To 31.03.2023",6093,1030,0,0,7123,6684,1130,0,0,7814,7475,1264,0,0,8739]
["Ladakh","From 04.11.2022 To ",11700,0,0,0,11700,13910,0,0,0,13910,14950,0,0,0,14950]
["Uttar Pradesh","From 01.04.2023 To 30.09.2023",5750,4339,0,0,10089,6325,4773,0,0,11098,7085,5347,0,0,12432]
["Uttarakhand","From 01.04.2023 To 30.09.2023",8331,1560,0,0,9891,8924,1560,0,0,10484,9518,1560,0,0,11078]
["West Bengal","From 01.01.2023 to 30.06.2023",9784,0,0,0,9784,10763,0,0,0,10763,11840,0,0,0,11840]