{"text_format":"1","workbook":"xlsx","n_sheets":3,"sheets":["Annexure_Sheet","Employee_Data","MinimumWages"],"not_rendered":{"charts":0,"images":3,"macros":1,"external_links":1,"defined_names":10,"comments":0,"pivot_tables":0},"unopened":[],"bounds":{"document_bytes":16777216,"sheet_cells":100000,"rows_first":2000,"rows_last":500,"rows_between":2000,"halvings":0,"cell_chars":16384,"cell_head_chars":4096},"cells_cut":0,"cells_raw":0,"read":"whole","date_system":"1900"}

{"sheet":"Annexure_Sheet","index":0,"n_rows":46,"n_cols":13,"rows_kept":46,"cut":false,"hidden":false,"merged":[[3,8,8,12],[37,2,38,4],[1,2,1,4],[3,3,3,4],[4,3,4,4],[5,3,5,4],[6,3,6,4],[2,2,2,4]]}
[1,null,null,null,null,null,null,null,null,null,1,"To",6]
[{"$f":"IF(VLOOKUP(SRN,Employee_Data!$A$1:$BU$987,MATCH(\"Title\",Employee_Data!$A$1:$BW$1,0),0)=\"Mr.\",\"M\",\"F\")","v":"F"},null,"Salary Annexure"]
[null,null,"CTC STRUCTURE & BENEFITS 2023 - 2024"]
[null,null,"Employee Name",{"$f":"VLOOKUP(SRN,Employee_Data!$A$1:$BU$987,MATCH(\"Title\",Employee_Data!$A$1:$BW$1,0),0)&\" \"&VLOOKUP(SRN,Employee_Data!$A$1:$BU$987,MATCH(Annexure_Sheet!C4,Employee_Data!$A$1:$BW$1,0),0)","v":"Ms. AVLEEN KUMAR"},null,null,null,null,"This Sheet prepared by Kumar Ajit, and it's Free to download and use for All. Any paid Assistance Required: ajityadav121@gmail.com"]
[null,null,"Emp.Code",{"$f":"VLOOKUP(SRN,Employee_Data!$A$1:$BU$987,MATCH(Annexure_Sheet!C5,Employee_Data!$A$1:$BW$1,0),0)","v":"E0001"}]
[null,null,"Designation",{"$f":"VLOOKUP(SRN,Employee_Data!$A$1:$BU$987,MATCH(Annexure_Sheet!C6,Employee_Data!$A$1:$BW$1,0),0)","v":"Manager"}]
[null,null,"STATE",{"$f":"VLOOKUP(SRN,Employee_Data!$A$1:$BU$987,MATCH(Annexure_Sheet!C7,Employee_Data!$A$1:$BW$1,0),0)","v":"Delhi"}]
[null,null,"Particulars","Monthly (Rs.)","Annual (Rs.)"]
[null,null,{"$f":"TRANSPOSE(Employee_Data!$N$1:$U$1)","v":"Basic Salary"},{"$f":"VLOOKUP(SRN,Employee_Data!$A$1:$BU$987,MATCH(Annexure_Sheet!C9,Employee_Data!$A$1:$BW$1,0),0)","v":20357},{"$f":"ROUND(D9*12,0)","v":244284}]
[null,null,"House Rent Allowance",{"$f":"VLOOKUP(SRN,Employee_Data!$A$1:$BU$987,MATCH(Annexure_Sheet!C10,Employee_Data!$A$1:$BW$1,0),0)","v":1018},{"$f":"ROUND(D10*12,0)","v":12216}]
[null,null,"Special Allowance",{"$f":"VLOOKUP(SRN,Employee_Data!$A$1:$BU$987,MATCH(Annexure_Sheet!C11,Employee_Data!$A$1:$BW$1,0),0)","v":-1292},-15504]
[null,null,"Washing Allowance",{"$f":"VLOOKUP(SRN,Employee_Data!$A$1:$BU$987,MATCH(Annexure_Sheet!C12,Employee_Data!$A$1:$BW$1,0),0)","v":0},0]
[null,null,"Uniform Allowance",{"$f":"VLOOKUP(SRN,Employee_Data!$A$1:$BU$987,MATCH(Annexure_Sheet!C13,Employee_Data!$A$1:$BW$1,0),0)","v":0},0]
[null,null,"Child Education Allowance",{"$f":"VLOOKUP(SRN,Employee_Data!$A$1:$BU$987,MATCH(Annexure_Sheet!C14,Employee_Data!$A$1:$BW$1,0),0)","v":0},0]
[null,null,"Fuel Reimbursement",{"$f":"VLOOKUP(SRN,Employee_Data!$A$1:$BU$987,MATCH(Annexure_Sheet!C15,Employee_Data!$A$1:$BW$1,0),0)","v":0},0]
[null,null,"NPS Contribution",{"$f":"VLOOKUP(SRN,Employee_Data!$A$1:$BU$987,MATCH(Annexure_Sheet!C16,Employee_Data!$A$1:$BW$1,0),0)","v":0},0]
[null,null,"Gross Salary [A]",{"$f":"SUM(D9:D16)","v":20083},{"$f":"SUM(E9:E16)","v":240996}]
[null,null,{"$f":"TRANSPOSE(Employee_Data!$W$1:$X$1)","v":"PF Employer"},{"$f":"VLOOKUP(SRN,Employee_Data!$A$1:$BU$987,MATCH(Annexure_Sheet!C18,Employee_Data!$A$1:$BW$1,0),0)","v":2443},29316]
[null,null,"ESIC Employer",{"$f":"VLOOKUP(SRN,Employee_Data!$A$1:$BU$987,MATCH(Annexure_Sheet!C19,Employee_Data!$A$1:$BW$1,0),0)","v":754},9048]
[null,null,"Fixed Salary [B]",{"$f":"SUM(D17:D19)","v":23280},{"$f":"SUM(E17:E19)","v":279360}]
[null,null,{"$f":"TRANSPOSE(Employee_Data!$Z$1:$AB$1)","v":"Bonus"},{"$f":"VLOOKUP(SRN,Employee_Data!$A$1:$BU$987,MATCH(Annexure_Sheet!C21,Employee_Data!$A$1:$BW$1,0),0)","v":1741},20892]
[null,null,"Gratuity",{"$f":"VLOOKUP(SRN,Employee_Data!$A$1:$BU$987,MATCH(Annexure_Sheet!C22,Employee_Data!$A$1:$BW$1,0),0)","v":979},11748]
[null,null,"Variable Pay",{"$f":"VLOOKUP(SRN,Employee_Data!$A$1:$BU$987,MATCH(Annexure_Sheet!C23,Employee_Data!$A$1:$BW$1,0),0)","v":0},0]
[null,null,"CTC - Grand Total [C]",{"$f":"SUM(D20:D23)","v":26000},{"$f":"SUM(E20:E23)","v":312000}]
[null,null,"Deductions:"," "," "]
[null,null,"PF Employee Contribution",{"$f":"D18","v":2443},29316]
[null,null,"ESIC Employee Contribution",{"$f":"IF(D19>0,ROUND(D17*0.75%,0),0)","v":151},1812]
[null,null,"Labour Welfare Fund (LWF)",{"$f":"LWF(UPPER(D7),TODAY())","v":1},{"$f":"ROUND(D28*12,0)","v":12}]
[null,null,"Professional Tax (P.Tax)",{"$f":"PTAX(UPPER(D7),D17,A2)","v":0},{"$f":"ROUND(D29*12,0)","v":0}]
[null,null,"Net In-Hand (Before Tax)      [A - Deductions]",{"$f":"D17-D26-D27-D28-D29","v":17488},{"$f":"E17-E26-E27-E28-E29","v":209856}]
{"$rows_left_out":17}
{"sheet":"Employee_Data","index":1,"n_rows":462,"n_cols":32,"rows_kept":462,"cut":false,"hidden":false,"merged":[]}
["SR","Emp.Code","Title","Employee Name","DOJ","Designation","STATE","Worker's Skill","PF Applicable","PF Limit","MONTHLY_CTC","MINWAGES","ANNUAL","Basic Salary","House Rent Allowance","Special Allowance","Washing Allowance","Uniform Allowance","Child Education Allowance","Fuel Reimbursement","NPS Contribution","Gross Salary [Total]","PF Employer","ESIC Employer","Fixed Salary [Total]","Bonus","Gratuity","Variable Pay","Monthly CTC","Annual CTC","DIFF","Error Remark"]
[{"$f":"ROW()-1","v":1},"E0001","Ms.","AVLEEN KUMAR","2012-03-31","Manager","Delhi","Skilled","Yes","Yes",26000,{"$f":"IFERROR(VLOOKUP(G2,MinimumWages!$A$1:$R$60,MATCH(Employee_Data!H2,MinimumWages!$A$1:$R$1,0),0),0)","v":20903},{"$f":"ROUND(K2*12,0)","v":312000},{"$f":"ROUND(MAX(ROUNDUP(IF(K2>30000,K2/2,L2/3*2),-2),IFERROR(VLOOKUP(G2,MinimumWages!$A$1:$R$60,(MATCH(Employee_Data!H2,MinimumWages!$A$1:$R$1,0)-4),0),0)),0)","v":20357},{"$f":"ROUND(IF(K2<30000,N2*5%,N2/2),0)","v":1018},-1292,0,0,0,0,0,{"$f":"SUM(N2:U2)","v":20083},{"$f":"IF(I2=\"Yes\",ROUND(IF(J2=\"Limit\",MIN((V2-O2),15000),IF(N2>15000,N2,MIN((V2-O2),15000)))*12%,0),0)","v":2443},{"$f":"IF(V2>21000,0,ROUNDUP(V2*3.75%,0))","v":754},{"$f":"SUM(V2:X2)","v":23280},{"$f":"IF(AND(N2<=21000,K2>0),ROUND(MAX(L2,7000)*8.33%,0),0)","v":1741},{"$f":"ROUND(N2/26*15/12,0)","v":979},0,{"$f":"SUM(Y2:AB2)","v":26000},{"$f":"ROUND(AC2*12,0)","v":312000},{"$f":"ROUND((M2-AD2)/12,0)","v":0},{"$f":"IF(AE2<>0,\"Un-Matched CTC\",IF(COUNTIF(N2:AE2,\"<0\")>0,\"Less CTC\",\"-\"))","v":"Less CTC"}]
[{"$f":"ROW()-1","v":2},"E0002","Mrs.","ANIL YADAV","2010-11-23","Executive","Delhi","Semi-Skilled","Yes","On-Basic",330908,{"$f":"IFERROR(VLOOKUP(G3,MinimumWages!$A$1:$R$60,MATCH(Employee_Data!H3,MinimumWages!$A$1:$R$1,0),0),0)","v":18993},3970896,{"$f":"ROUND(MAX(ROUNDUP(IF(K3>30000,K3/2,L3/3*2),-2),IFERROR(VLOOKUP(G3,MinimumWages!$A$1:$R$60,(MATCH(Employee_Data!H3,MinimumWages!$A$1:$R$1,0)-4),0),0)),0)","v":165500},82750,54841,0,0,0,0,0,{"$f":"SUM(N3:U3)","v":303091},19860,{"$f":"IF(V3>21000,0,ROUNDUP(V3*3.75%,0))","v":0},{"$f":"SUM(V3:X3)","v":322951},0,{"$f":"ROUND(N3/26*15/12,0)","v":7957},0,{"$f":"SUM(Y3:AB3)","v":330908},{"$f":"ROUND(AC3*12,0)","v":3970896},{"$f":"ROUND((M3-AD3)/12,0)","v":0},{"$f":"IF(AE3<>0,\"Un-Matched CTC\",IF(COUNTIF(N3:AE3,\"<0\")>0,\"Less CTC\",\"-\"))","v":"-"}]
[3,"E0003","Ms.","ANCHAL SHARMA","2011-04-01","Sr. Executive","Haryana","Skilled","Yes","Yes",42717,{"$f":"IFERROR(VLOOKUP(G4,MinimumWages!$A$1:$R$60,MATCH(Employee_Data!H4,MinimumWages!$A$1:$R$1,0),0),0)","v":12803},512604,{"$f":"ROUND(MAX(ROUNDUP(IF(K4>30000,K4/2,L4/3*2),-2),IFERROR(VLOOKUP(G4,MinimumWages!$A$1:$R$60,(MATCH(Employee_Data!H4,MinimumWages!$A$1:$R$1,0)-4),0),0)),0)","v":21400},10700,7020,0,0,0,0,0,39120,2568,0,41688,0,1029,0,42717,512604,0,"-"]
[4,"E0004","Mr.","BRAHM MISHRA","2013-05-29","Sr. Executive","Maharashtra","Skilled","Not-Applicable","Yes",16000,{"$f":"IFERROR(VLOOKUP(G5,MinimumWages!$A$1:$R$60,MATCH(Employee_Data!H5,MinimumWages!$A$1:$R$1,0),0),0)","v":14658},192000,{"$f":"ROUND(MAX(ROUNDUP(IF(K5>30000,K5/2,L5/3*2),-2),IFERROR(VLOOKUP(G5,MinimumWages!$A$1:$R$60,(MATCH(Employee_Data!H5,MinimumWages!$A$1:$R$1,0)-4),0),0)),0)","v":11632},582,1492,0,0,0,0,0,13706,0,514,14220,1221,559,0,16000,192000,0,"-"]
[5,"E0005","Mr.","PURAN UNIYAL","2019-11-30","Executive","Bihar","Skilled","Yes","Yes",45808,{"$f":"IFERROR(VLOOKUP(G6,MinimumWages!$A$1:$R$60,MATCH(Employee_Data!H6,MinimumWages!$A$1:$R$1,0),0),0)","v":12766},549696,{"$f":"ROUND(MAX(ROUNDUP(IF(K6>30000,K6/2,L6/3*2),-2),IFERROR(VLOOKUP(G6,MinimumWages!$A$1:$R$60,(MATCH(Employee_Data!H6,MinimumWages!$A$1:$R$1,0)-4),0),0)),0)","v":23000},11500,7442,0,0,0,0,0,41942,2760,0,44702,0,1106,0,45808,549696,0,"-"]
[6,"E0006","Mrs.","MAHESH RAJBHAR","2009-04-12","Sr. Manager","Maharashtra","Skilled","Yes","Yes",69975,{"$f":"IFERROR(VLOOKUP(G7,MinimumWages!$A$1:$R$60,MATCH(Employee_Data!H7,MinimumWages!$A$1:$R$1,0),0),0)","v":14658},839700,{"$f":"ROUND(MAX(ROUNDUP(IF(K7>30000,K7/2,L7/3*2),-2),IFERROR(VLOOKUP(G7,MinimumWages!$A$1:$R$60,(MATCH(Employee_Data!H7,MinimumWages!$A$1:$R$1,0)-4),0),0)),0)","v":35000},17500,11592,0,0,0,0,0,64092,4200,0,68292,0,1683,0,69975,839700,0,"-"]
[7,null,null,null,null,null,null,null,null,null,null,{"$f":"IFERROR(VLOOKUP(G8,MinimumWages!$A$1:$R$60,MATCH(Employee_Data!H8,MinimumWages!$A$1:$R$1,0),0),0)","v":0},{"$f":"ROUND(K8*12,0)","v":0},{"$f":"ROUND(MAX(ROUNDUP(IF(K8>30000,K8/2,L8/3*2),-2),IFERROR(VLOOKUP(G8,MinimumWages!$A$1:$R$60,(MATCH(Employee_Data!H8,MinimumWages!$A$1:$R$1,0)-4),0),0)),0)","v":0},{"$f":"ROUND(IF(K8<30000,N8*5%,N8/2),0)","v":0},0,0,0,0,0,0,{"$f":"SUM(N8:U8)","v":0},{"$f":"IF(I8=\"Yes\",ROUND(IF(J8=\"Limit\",MIN((V8-O8),15000),IF(N8>15000,N8,MIN((V8-O8),15000)))*12%,0),0)","v":0},{"$f":"IF(V8>21000,0,ROUNDUP(V8*3.75%,0))","v":0},{"$f":"SUM(V8:X8)","v":0},{"$f":"IF(AND(N8<=21000,K8>0),ROUND(MAX(L8,7000)*8.33%,0),0)","v":0},{"$f":"ROUND(N8/26*15/12,0)","v":0},0,{"$f":"SUM(Y8:AB8)","v":0},0,{"$f":"ROUND((M8-AD8)/12,0)","v":0},{"$f":"IF(AE8<>0,\"Un-Matched CTC\",IF(COUNTIF(N8:AE8,\"<0\")>0,\"Less CTC\",\"-\"))","v":"-"}]
[8,null,null,null,null,null,null,null,null,null,null,{"$f":"IFERROR(VLOOKUP(G9,MinimumWages!$A$1:$R$60,MATCH(Employee_Data!H9,MinimumWages!$A$1:$R$1,0),0),0)","v":0},0,{"$f":"ROUND(MAX(ROUNDUP(IF(K9>30000,K9/2,L9/3*2),-2),IFERROR(VLOOKUP(G9,MinimumWages!$A$1:$R$60,(MATCH(Employee_Data!H9,MinimumWages!$A$1:$R$1,0)-4),0),0)),0)","v":0},0,0,0,0,0,0,0,0,0,0,0,0,0,0,0,0,0,"-"]
[9,null,null,null,null,null,null,null,null,null,null,{"$f":"IFERROR(VLOOKUP(G10,MinimumWages!$A$1:$R$60,MATCH(Employee_Data!H10,MinimumWages!$A$1:$R$1,0),0),0)","v":0},0,{"$f":"ROUND(MAX(ROUNDUP(IF(K10>30000,K10/2,L10/3*2),-2),IFERROR(VLOOKUP(G10,MinimumWages!$A$1:$R$60,(MATCH(Employee_Data!H10,MinimumWages!$A$1:$R$1,0)-4),0),0)),0)","v":0},0,0,0,0,0,0,0,0,0,0,0,0,0,0,0,0,0,"-"]
[10,null,null,null,null,null,null,null,null,null,null,{"$f":"IFERROR(VLOOKUP(G11,MinimumWages!$A$1:$R$60,MATCH(Employee_Data!H11,MinimumWages!$A$1:$R$1,0),0),0)","v":0},0,{"$f":"ROUND(MAX(ROUNDUP(IF(K11>30000,K11/2,L11/3*2),-2),IFERROR(VLOOKUP(G11,MinimumWages!$A$1:$R$60,(MATCH(Employee_Data!H11,MinimumWages!$A$1:$R$1,0)-4),0),0)),0)","v":0},0,0,0,0,0,0,0,0,0,0,0,0,0,0,0,0,0,"-"]
[11,null,null,null,null,null,null,null,null,null,null,{"$f":"IFERROR(VLOOKUP(G12,MinimumWages!$A$1:$R$60,MATCH(Employee_Data!H12,MinimumWages!$A$1:$R$1,0),0),0)","v":0},0,{"$f":"ROUND(MAX(ROUNDUP(IF(K12>30000,K12/2,L12/3*2),-2),IFERROR(VLOOKUP(G12,MinimumWages!$A$1:$R$60,(MATCH(Employee_Data!H12,MinimumWages!$A$1:$R$1,0)-4),0),0)),0)","v":0},0,0,0,0,0,0,0,0,0,0,0,0,0,0,0,0,0,"-"]
[12,null,null,null,null,null,null,null,null,null,null,{"$f":"IFERROR(VLOOKUP(G13,MinimumWages!$A$1:$R$60,MATCH(Employee_Data!H13,MinimumWages!$A$1:$R$1,0),0),0)","v":0},0,{"$f":"ROUND(MAX(ROUNDUP(IF(K13>30000,K13/2,L13/3*2),-2),IFERROR(VLOOKUP(G13,MinimumWages!$A$1:$R$60,(MATCH(Employee_Data!H13,MinimumWages!$A$1:$R$1,0)-4),0),0)),0)","v":0},0,0,0,0,0,0,0,0,0,0,0,0,0,0,0,0,0,"-"]
[13,null,null,null,null,null,null,null,null,null,null,{"$f":"IFERROR(VLOOKUP(G14,MinimumWages!$A$1:$R$60,MATCH(Employee_Data!H14,MinimumWages!$A$1:$R$1,0),0),0)","v":0},0,{"$f":"ROUND(MAX(ROUNDUP(IF(K14>30000,K14/2,L14/3*2),-2),IFERROR(VLOOKUP(G14,MinimumWages!$A$1:$R$60,(MATCH(Employee_Data!H14,MinimumWages!$A$1:$R$1,0)-4),0),0)),0)","v":0},0,0,0,0,0,0,0,0,0,0,0,0,0,0,0,0,0,"-"]
[14,null,null,null,null,null,null,null,null,null,null,{"$f":"IFERROR(VLOOKUP(G15,MinimumWages!$A$1:$R$60,MATCH(Employee_Data!H15,MinimumWages!$A$1:$R$1,0),0),0)","v":0},0,{"$f":"ROUND(MAX(ROUNDUP(IF(K15>30000,K15/2,L15/3*2),-2),IFERROR(VLOOKUP(G15,MinimumWages!$A$1:$R$60,(MATCH(Employee_Data!H15,MinimumWages!$A$1:$R$1,0)-4),0),0)),0)","v":0},0,0,0,0,0,0,0,0,0,0,0,0,0,0,0,0,0,"-"]
[15,null,null,null,null,null,null,null,null,null,null,{"$f":"IFERROR(VLOOKUP(G16,MinimumWages!$A$1:$R$60,MATCH(Employee_Data!H16,MinimumWages!$A$1:$R$1,0),0),0)","v":0},0,{"$f":"ROUND(MAX(ROUNDUP(IF(K16>30000,K16/2,L16/3*2),-2),IFERROR(VLOOKUP(G16,MinimumWages!$A$1:$R$60,(MATCH(Employee_Data!H16,MinimumWages!$A$1:$R$1,0)-4),0),0)),0)","v":0},0,0,0,0,0,0,0,0,0,0,0,0,0,0,0,0,0,"-"]
[16,null,null,null,null,null,null,null,null,null,null,{"$f":"IFERROR(VLOOKUP(G17,MinimumWages!$A$1:$R$60,MATCH(Employee_Data!H17,MinimumWages!$A$1:$R$1,0),0),0)","v":0},0,{"$f":"ROUND(MAX(ROUNDUP(IF(K17>30000,K17/2,L17/3*2),-2),IFERROR(VLOOKUP(G17,MinimumWages!$A$1:$R$60,(MATCH(Employee_Data!H17,MinimumWages!$A$1:$R$1,0)-4),0),0)),0)","v":0},0,0,0,0,0,0,0,0,0,0,0,0,0,0,0,0,0,"-"]
[17,null,null,null,null,null,null,null,null,null,null,{"$f":"IFERROR(VLOOKUP(G18,MinimumWages!$A$1:$R$60,MATCH(Employee_Data!H18,MinimumWages!$A$1:$R$1,0),0),0)","v":0},0,{"$f":"ROUND(MAX(ROUNDUP(IF(K18>30000,K18/2,L18/3*2),-2),IFERROR(VLOOKUP(G18,MinimumWages!$A$1:$R$60,(MATCH(Employee_Data!H18,MinimumWages!$A$1:$R$1,0)-4),0),0)),0)","v":0},0,0,0,0,0,0,0,0,0,0,0,0,0,0,0,0,0,"-"]
[18,null,null,null,null,null,null,null,null,null,null,{"$f":"IFERROR(VLOOKUP(G19,MinimumWages!$A$1:$R$60,MATCH(Employee_Data!H19,MinimumWages!$A$1:$R$1,0),0),0)","v":0},0,{"$f":"ROUND(MAX(ROUNDUP(IF(K19>30000,K19/2,L19/3*2),-2),IFERROR(VLOOKUP(G19,MinimumWages!$A$1:$R$60,(MATCH(Employee_Data!H19,MinimumWages!$A$1:$R$1,0)-4),0),0)),0)","v":0},0,0,0,0,0,0,0,0,0,0,0,0,0,0,0,0,0,"-"]
[19,null,null,null,null,null,null,null,null,null,null,{"$f":"IFERROR(VLOOKUP(G20,MinimumWages!$A$1:$R$60,MATCH(Employee_Data!H20,MinimumWages!$A$1:$R$1,0),0),0)","v":0},0,{"$f":"ROUND(MAX(ROUNDUP(IF(K20>30000,K20/2,L20/3*2),-2),IFERROR(VLOOKUP(G20,MinimumWages!$A$1:$R$60,(MATCH(Employee_Data!H20,MinimumWages!$A$1:$R$1,0)-4),0),0)),0)","v":0},0,0,0,0,0,0,0,0,0,0,0,0,0,0,0,0,0,"-"]
[20,null,null,null,null,null,null,null,null,null,null,{"$f":"IFERROR(VLOOKUP(G21,MinimumWages!$A$1:$R$60,MATCH(Employee_Data!H21,MinimumWages!$A$1:$R$1,0),0),0)","v":0},0,{"$f":"ROUND(MAX(ROUNDUP(IF(K21>30000,K21/2,L21/3*2),-2),IFERROR(VLOOKUP(G21,MinimumWages!$A$1:$R$60,(MATCH(Employee_Data!H21,MinimumWages!$A$1:$R$1,0)-4),0),0)),0)","v":0},0,0,0,0,0,0,0,0,0,0,0,0,0,0,0,0,0,"-"]
[21,null,null,null,null,null,null,null,null,null,null,{"$f":"IFERROR(VLOOKUP(G22,MinimumWages!$A$1:$R$60,MATCH(Employee_Data!H22,MinimumWages!$A$1:$R$1,0),0),0)","v":0},0,{"$f":"ROUND(MAX(ROUNDUP(IF(K22>30000,K22/2,L22/3*2),-2),IFERROR(VLOOKUP(G22,MinimumWages!$A$1:$R$60,(MATCH(Employee_Data!H22,MinimumWages!$A$1:$R$1,0)-4),0),0)),0)","v":0},0,0,0,0,0,0,0,0,0,0,0,0,0,0,0,0,0,"-"]
[22,null,null,null,null,null,null,null,null,null,null,{"$f":"IFERROR(VLOOKUP(G23,MinimumWages!$A$1:$R$60,MATCH(Employee_Data!H23,MinimumWages!$A$1:$R$1,0),0),0)","v":0},0,{"$f":"ROUND(MAX(ROUNDUP(IF(K23>30000,K23/2,L23/3*2),-2),IFERROR(VLOOKUP(G23,MinimumWages!$A$1:$R$60,(MATCH(Employee_Data!H23,MinimumWages!$A$1:$R$1,0)-4),0),0)),0)","v":0},0,0,0,0,0,0,0,0,0,0,0,0,0,0,0,0,0,"-"]
[23,null,null,null,null,null,null,null,null,null,null,{"$f":"IFERROR(VLOOKUP(G24,MinimumWages!$A$1:$R$60,MATCH(Employee_Data!H24,MinimumWages!$A$1:$R$1,0),0),0)","v":0},0,{"$f":"ROUND(MAX(ROUNDUP(IF(K24>30000,K24/2,L24/3*2),-2),IFERROR(VLOOKUP(G24,MinimumWages!$A$1:$R$60,(MATCH(Employee_Data!H24,MinimumWages!$A$1:$R$1,0)-4),0),0)),0)","v":0},0,0,0,0,0,0,0,0,0,0,0,0,0,0,0,0,0,"-"]
[24,null,null,null,null,null,null,null,null,null,null,{"$f":"IFERROR(VLOOKUP(G25,MinimumWages!$A$1:$R$60,MATCH(Employee_Data!H25,MinimumWages!$A$1:$R$1,0),0),0)","v":0},0,{"$f":"ROUND(MAX(ROUNDUP(IF(K25>30000,K25/2,L25/3*2),-2),IFERROR(VLOOKUP(G25,MinimumWages!$A$1:$R$60,(MATCH(Employee_Data!H25,MinimumWages!$A$1:$R$1,0)-4),0),0)),0)","v":0},0,0,0,0,0,0,0,0,0,0,0,0,0,0,0,0,0,"-"]
[25,null,null,null,null,null,null,null,null,null,null,{"$f":"IFERROR(VLOOKUP(G26,MinimumWages!$A$1:$R$60,MATCH(Employee_Data!H26,MinimumWages!$A$1:$R$1,0),0),0)","v":0},0,{"$f":"ROUND(MAX(ROUNDUP(IF(K26>30000,K26/2,L26/3*2),-2),IFERROR(VLOOKUP(G26,MinimumWages!$A$1:$R$60,(MATCH(Employee_Data!H26,MinimumWages!$A$1:$R$1,0)-4),0),0)),0)","v":0},0,0,0,0,0,0,0,0,0,0,0,0,0,0,0,0,0,"-"]
[26,null,null,null,null,null,null,null,null,null,null,{"$f":"IFERROR(VLOOKUP(G27,MinimumWages!$A$1:$R$60,MATCH(Employee_Data!H27,MinimumWages!$A$1:$R$1,0),0),0)","v":0},0,{"$f":"ROUND(MAX(ROUNDUP(IF(K27>30000,K27/2,L27/3*2),-2),IFERROR(VLOOKUP(G27,MinimumWages!$A$1:$R$60,(MATCH(Employee_Data!H27,MinimumWages!$A$1:$R$1,0)-4),0),0)),0)","v":0},0,0,0,0,0,0,0,0,0,0,0,0,0,0,0,0,0,"-"]
[27,null,null,null,null,null,null,null,null,null,null,{"$f":"IFERROR(VLOOKUP(G28,MinimumWages!$A$1:$R$60,MATCH(Employee_Data!H28,MinimumWages!$A$1:$R$1,0),0),0)","v":0},0,{"$f":"ROUND(MAX(ROUNDUP(IF(K28>30000,K28/2,L28/3*2),-2),IFERROR(VLOOKUP(G28,MinimumWages!$A$1:$R$60,(MATCH(Employee_Data!H28,MinimumWages!$A$1:$R$1,0)-4),0),0)),0)","v":0},0,0,0,0,0,0,0,0,0,0,0,0,0,0,0,0,0,"-"]
[28,null,null,null,null,null,null,null,null,null,null,{"$f":"IFERROR(VLOOKUP(G29,MinimumWages!$A$1:$R$60,MATCH(Employee_Data!H29,MinimumWages!$A$1:$R$1,0),0),0)","v":0},0,{"$f":"ROUND(MAX(ROUNDUP(IF(K29>30000,K29/2,L29/3*2),-2),IFERROR(VLOOKUP(G29,MinimumWages!$A$1:$R$60,(MATCH(Employee_Data!H29,MinimumWages!$A$1:$R$1,0)-4),0),0)),0)","v":0},0,0,0,0,0,0,0,0,0,0,0,0,0,0,0,0,0,"-"]
[29,null,null,null,null,null,null,null,null,null,null,{"$f":"IFERROR(VLOOKUP(G30,MinimumWages!$A$1:$R$60,MATCH(Employee_Data!H30,MinimumWages!$A$1:$R$1,0),0),0)","v":0},0,{"$f":"ROUND(MAX(ROUNDUP(IF(K30>30000,K30/2,L30/3*2),-2),IFERROR(VLOOKUP(G30,MinimumWages!$A$1:$R$60,(MATCH(Employee_Data!H30,MinimumWages!$A$1:$R$1,0)-4),0),0)),0)","v":0},0,0,0,0,0,0,0,0,0,0,0,0,0,0,0,0,0,"-"]
{"$rows_left_out":433}
{"sheet":"MinimumWages","index":2,"n_rows":37,"n_cols":18,"rows_kept":37,"cut":false,"hidden":false,"merged":[]}
["State","Effective From - To","Basic+DA","VDA","HRA","SPLALL","Unskilled","Basic+DA","VDA","HRA","SPLALL","Semi-Skilled","Basic+DA","VDA","HRA","SPLALL","Skilled","Upadted on 03.05.2023"]
["Andhra Pradesh","From 01.04.2023 To 30.09.2023",3700,7379,0,0,{"$f":"SUM(C2:F2)","v":11079},4102,7379,0,0,{"$f":"SUM(H2:K2)","v":11481},4722,7379,0,0,{"$f":"SUM(M2:P2)","v":12101}]
["Andaman","From 01.01.2023 to 30.06.2023",13754,0,0,0,{"$f":"SUM(C3:F3)","v":13754},15236,0,0,0,{"$f":"SUM(H3:K3)","v":15236},17446,0,0,0,{"$f":"SUM(M3:P3)","v":17446}]
["Arunachal Pradesh","From 01.04.2016 to Till Date",6600,0,0,0,6600,6900,0,0,0,6900,7200,0,0,0,7200]
["Assam","From 01.06.2021 to Till Date",7200,1746,0,0,8946,8400,2038,0,0,10438,10500,2548,0,0,13048]
["Bihar","From 01.04.2023 To 30.09.2023",6344,3744,0,0,10088,6630,3848,0,0,10478,8060,4706,0,0,12766]
["Chandigarh","From 01.10.2022 To 31.03.2023",12623,0,0,0,12623,12873,0,0,0,12873,13298,0,0,0,13298]
["Chhattisgarh","From 01.04.2023 To 30.09.2023",8320,2160,0,0,10480,8970,2160,0,0,11130,9750,2160,0,0,11910]
["Dadra & Nagar Haveli","From 01.04.2021 to Till Date",6968,1877,0,0,8845,7176,1877,0,0,9053,7384,1877,0,0,9261]
["Daman and Diu","From 01.04.2020 to Till Date",6968,1469,0,0,8437,7176,1469,0,0,8645,7384,1469,0,0,8853]
["Delhi","From 01.04.2023 To 30.09.2023",16792,442,0,0,17234,18499,494,0,0,18993,20357,546,0,0,20903]
["Goa","From 01.10.2022 To 31.03.2023",8060,2392,0,0,10452,9568,2392,0,0,11960,10998,2392,0,0,13390]
["Gujarat","From 01.04.2023 To 30.09.2023",7176,4576,0,0,11752,7384,4628,0,0,12012,7618,4706,0,0,12324]
["Haryana","From 01.01.2023 to 30-06-2023 ",7600,2933,0,0,10533,8379,3233,0,0,11612,9238,3565,0,0,12803]
["Himachal Pradesh","From 01.04.2022 To 30.09.2022",10500,0,0,0,10500,11098,0,0,0,11098,12191,0,0,0,12191]
["Jammu and Kashmir","From 17.10.2022",8086,0,0,0,8086,10400,0,0,0,10400,12558,0,0,0,12558]
["Jharkhand","From 01.04.2023 To 30.09.2023",7145,1851,0,0,8996,7485,1940,0,0,9425,9867,2557,0,0,12424]
["Karnataka","From 01.04.2023 to 31.03.2024",11588,2837,0,0,14425,12747,2837,0,0,15584,14021,2837,0,0,16858]
["Kerala","From 01.12.2022 to TILL Date",8910,4594,0,0,13504,8910,4594,0,0,13504,9330,4594,0,0,13924]
["Lakshadweep","From 01.01.2016 ",7618,0,0,0,7618,8424,0,0,0,8424,9906,0,0,0,9906]
["Madhya Pradesh","From 01.04.2023 To 30.09.2023",6500,3150,0,0,9650,7057,3450,0,0,10507,8435,3450,0,0,11885]
["Maharashtra","From 01.01.2023 to 30.06.2023",10021,2444,{"$f":"ROUND((C22)*5%,0)","v":501},0,12966,10856,2444,{"$f":"ROUND((H22)*5%,0)","v":543},0,13843,11632,2444,{"$f":"ROUND((M22)*5%,0)","v":582},0,14658]
["Meghalaya","From 01.10.2022 To 31.03.2023",7800,2106,0,0,9906,8840,2392,0,0,11232,9880,2678,0,0,12558]
["Mizoram","From 01.04.2016 to Till Date",7020,0,0,0,7020,7800,0,0,0,7800,9620,0,0,0,9620]
["Nagaland","From 14.06.2019",5280,0,0,0,5280,6300,0,0,0,6300,7050,0,0,0,7050]
["Odisha","From 01.04.2023 To 30.09.2023",7280,1690,0,0,8970,8320,1690,0,0,10010,9620,1690,0,0,11310]
["Pondicherry","From 01.01.2021",7433,233,0,0,7666,7542,233,0,0,7775,7591,233,0,0,7824]
["Punjab","From 01.03.2023 To 31.08.2023",10354,0,0,0,10354,11134,0,0,0,11134,12031,0,0,0,12031]
["Rajasthan","From 01.07.2021",6734,0,0,0,6734,7046,0,0,0,7046,7358,0,0,0,7358]
["Sikkim","From 11.07.2022",13000,0,0,0,13000,13520,0,0,0,13520,13910,0,0,0,13910]
{"$rows_left_out":7}